BDBM50319017 4-(5-(2-methoxybenzyl)-3-methylbenzo[b]thiophen-2-yl)pyrimidin-2-amine::CHEMBL1086543
SMILES: COc1ccccc1Cc1ccc2sc(c(C)c2c1)-c1ccnc(N)n1
InChI Key: InChIKey=WTZGRUBUIGZYJG-UHFFFAOYSA-N
Data: 1 IC50  1 EC50
Activity Spreadsheet -- Enzyme Inhibition Constant Data from BindingDB
Found 2 hits for monomerid = 50319017
Trg + Lig
Ki
nM
ΔG°
kcal/mole
IC50
nM
Kd
nM
EC50/IC50
nM
koff
s-1
kon
M-1s-1
pHTemp
°C
Rho-associated protein kinase 1
(Homo sapiens (Human))
BDBM50319017
(4-(5-(2-methoxybenzyl)-3-methylbenzo[b]thiophen-2-...)
Show SMILES COc1ccccc1Cc1ccc2sc(c(C)c2c1)-c1ccnc(N)n1
Show InChI InChI=1S/C21H19N3OS/c1-13-16-12-14(11-15-5-3-4-6-18(15)25-2)7-8-19(16)26-20(13)17-9-10-23-21(22)24-17/h3-10,12H,11H2,1-2H3,(H2,22,23,24)
NCI pathway
Reactome pathway
n/an/an/an/a>1.00E+4n/an/an/an/a
Kalypsys, Inc.
Curated by ChEMBL
Assay Description
Inhibition of ROCK1 in human GTM3 cells by impedance assay
Bioorg Med Chem Lett 20: 3361-6 (2010)
Article DOI: 10.1016/j.bmcl.2010.04.020
BindingDB Entry DOI: 10.7270/Q289161H
Rho-associated protein kinase 1
(Homo sapiens (Human))
BDBM50319017
(4-(5-(2-methoxybenzyl)-3-methylbenzo[b]thiophen-2-...)
Show SMILES COc1ccccc1Cc1ccc2sc(c(C)c2c1)-c1ccnc(N)n1
Show InChI InChI=1S/C21H19N3OS/c1-13-16-12-14(11-15-5-3-4-6-18(15)25-2)7-8-19(16)26-20(13)17-9-10-23-21(22)24-17/h3-10,12H,11H2,1-2H3,(H2,22,23,24)
NCI pathway
Reactome pathway
n/an/a 9.70E+3n/an/an/an/an/an/a
Kalypsys, Inc.
Curated by ChEMBL
Assay Description
Inhibition of ROCK1 assessed as ATP cunsumption
Bioorg Med Chem Lett 20: 3361-6 (2010)
Article DOI: 10.1016/j.bmcl.2010.04.020
BindingDB Entry DOI: 10.7270/Q289161H