BDBM50319148 3,4-Dimethyl-1-propyl-imidazo[1,5-a]pyrido[3,2-e]pyrazine::CHEMBL1086112
SMILES: CCCc1nc(C)c2c(C)nc3cccnc3n12
InChI Key: InChIKey=OTEGQHZFWMDYKX-UHFFFAOYSA-N
Data: 1 IC50
Activity Spreadsheet -- Enzyme Inhibition Constant Data from BindingDB
Found 1 hit for monomerid = 50319148
Trg + Lig
Ki
nM
ΔG°
kcal/mole
IC50
nM
Kd
nM
EC50/IC50
nM
koff
s-1
kon
M-1s-1
pHTemp
°C
cAMP and cAMP-inhibited cGMP 3',5'-cyclic phosphodiesterase 10A
(Homo sapiens (Human))
BDBM50319148
(3,4-Dimethyl-1-propyl-imidazo[1,5-a]pyrido[3,2-e]p...)
Show SMILES CCCc1nc(C)c2c(C)nc3cccnc3n12
Show InChI InChI=1S/C14H16N4/c1-4-6-12-17-10(3)13-9(2)16-11-7-5-8-15-14(11)18(12)13/h5,7-8H,4,6H2,1-3H3
Reactome pathway
n/an/a 33n/an/an/an/an/an/a
Biotie Therapies GmbH
Curated by ChEMBL
Assay Description
Inhibition of human recombinant PDE10A expressed in baculovirus-SF21 cell system assessed as hydrolysis of [3H]cAMP after 1 hr by liquid scintillatio...
J Med Chem 53: 4399-411 (2010)
Article DOI: 10.1021/jm1002793
BindingDB Entry DOI: 10.7270/Q2MK6D3N