BDBM50319174 1-Ethyl-8-methoxy-3-methyl-4-propyloxy-imidazo[1,5-a]pyrido-[3,2-e]pyrazine::CHEMBL1083167
SMILES: CCCOc1nc2ccc(OC)nc2n2c(CC)nc(C)c12
InChI Key: InChIKey=QGUUMNJEMZDEGS-UHFFFAOYSA-N
Data: 1 IC50
Activity Spreadsheet -- Enzyme Inhibition Constant Data from BindingDB
Found 1 hit for monomerid = 50319174
Trg + Lig
Ki
nM
ΔG°
kcal/mole
IC50
nM
Kd
nM
EC50/IC50
nM
koff
s-1
kon
M-1s-1
pHTemp
°C
cAMP and cAMP-inhibited cGMP 3',5'-cyclic phosphodiesterase 10A
(Homo sapiens (Human))
BDBM50319174
(1-Ethyl-8-methoxy-3-methyl-4-propyloxy-imidazo[1,5...)
Show SMILES CCCOc1nc2ccc(OC)nc2n2c(CC)nc(C)c12
Show InChI InChI=1S/C16H20N4O2/c1-5-9-22-16-14-10(3)17-12(6-2)20(14)15-11(18-16)7-8-13(19-15)21-4/h7-8H,5-6,9H2,1-4H3
Reactome pathway
n/an/a 149n/an/an/an/an/an/a
Biotie Therapies GmbH
Curated by ChEMBL
Assay Description
Inhibition of human recombinant PDE10A expressed in baculovirus-SF21 cell system assessed as hydrolysis of [3H]cAMP after 1 hr by liquid scintillatio...
J Med Chem 53: 4399-411 (2010)
Article DOI: 10.1021/jm1002793
BindingDB Entry DOI: 10.7270/Q2MK6D3N