BDBM50319184 3-Ethoxycarbonyl-8-methoxy-4-methyl-1-propyl-imidazo[1,5-a]pyrido[3,2-e]pyrazine::CHEMBL1083135
SMILES: CCCc1nc(C(=O)OCC)c2c(C)nc3ccc(OC)nc3n12
InChI Key: InChIKey=UPUSSYGKXHDPKM-UHFFFAOYSA-N
Data: 1 IC50
Activity Spreadsheet -- Enzyme Inhibition Constant Data from BindingDB
Found 1 hit for monomerid = 50319184
Trg + Lig
Ki
nM
ΔG°
kcal/mole
IC50
nM
Kd
nM
EC50/IC50
nM
koff
s-1
kon
M-1s-1
pHTemp
°C
cAMP and cAMP-inhibited cGMP 3',5'-cyclic phosphodiesterase 10A
(Homo sapiens (Human))
BDBM50319184
(3-Ethoxycarbonyl-8-methoxy-4-methyl-1-propyl-imida...)
Show SMILES CCCc1nc(C(=O)OCC)c2c(C)nc3ccc(OC)nc3n12
Show InChI InChI=1S/C17H20N4O3/c1-5-7-12-19-14(17(22)24-6-2)15-10(3)18-11-8-9-13(23-4)20-16(11)21(12)15/h8-9H,5-7H2,1-4H3
Reactome pathway
n/an/a 326n/an/an/an/an/an/a
Biotie Therapies GmbH
Curated by ChEMBL
Assay Description
Inhibition of human recombinant PDE10A expressed in baculovirus-SF21 cell system assessed as hydrolysis of [3H]cAMP after 1 hr by liquid scintillatio...
J Med Chem 53: 4399-411 (2010)
Article DOI: 10.1021/jm1002793
BindingDB Entry DOI: 10.7270/Q2MK6D3N