BDBM50319189 4,8-Dimethoxy-3-methyl-imidazo[1,5-a]pyrido[3,2-e]pyrazine::CHEMBL1083576
SMILES: COc1ccc2nc(OC)c3c(C)ncn3c2n1
InChI Key: InChIKey=QDKYKMXBPSVDHS-UHFFFAOYSA-N
Data: 1 IC50
Activity Spreadsheet -- Enzyme Inhibition Constant Data from BindingDB
Found 1 hit for monomerid = 50319189
Trg + Lig
Ki
nM
ΔG°
kcal/mole
IC50
nM
Kd
nM
EC50/IC50
nM
koff
s-1
kon
M-1s-1
pHTemp
°C
cAMP and cAMP-inhibited cGMP 3',5'-cyclic phosphodiesterase 10A
(Homo sapiens (Human))
BDBM50319189
(4,8-Dimethoxy-3-methyl-imidazo[1,5-a]pyrido[3,2-e]...)
Show SMILES COc1ccc2nc(OC)c3c(C)ncn3c2n1
Show InChI InChI=1S/C12H12N4O2/c1-7-10-12(18-3)14-8-4-5-9(17-2)15-11(8)16(10)6-13-7/h4-6H,1-3H3
Reactome pathway
n/an/a 2.27E+3n/an/an/an/an/an/a
Biotie Therapies GmbH
Curated by ChEMBL
Assay Description
Inhibition of human recombinant PDE10A expressed in baculovirus-SF21 cell system assessed as hydrolysis of [3H]cAMP after 1 hr by liquid scintillatio...
J Med Chem 53: 4399-411 (2010)
Article DOI: 10.1021/jm1002793
BindingDB Entry DOI: 10.7270/Q2MK6D3N