BDBM50319191 8-Methoxy-3-methyl-4-(3-phenyl-propoxy)-1-propyl-imidazo-[1,5-a]pyrido[3,2-e]pyrazine::CHEMBL1085039
SMILES: CCCc1nc(C)c2c(OCCCc3ccccc3)nc3ccc(OC)nc3n12
InChI Key: InChIKey=YTHBIMNEJCMPJN-UHFFFAOYSA-N
Data: 1 IC50
Activity Spreadsheet -- Enzyme Inhibition Constant Data from BindingDB
Found 1 hit for monomerid = 50319191
Trg + Lig
Ki
nM
ΔG°
kcal/mole
IC50
nM
Kd
nM
EC50/IC50
nM
koff
s-1
kon
M-1s-1
pHTemp
°C
cAMP and cAMP-inhibited cGMP 3',5'-cyclic phosphodiesterase 10A
(Homo sapiens (Human))
BDBM50319191
(8-Methoxy-3-methyl-4-(3-phenyl-propoxy)-1-propyl-i...)
Show SMILES CCCc1nc(C)c2c(OCCCc3ccccc3)nc3ccc(OC)nc3n12
Show InChI InChI=1S/C23H26N4O2/c1-4-9-19-24-16(2)21-23(29-15-8-12-17-10-6-5-7-11-17)25-18-13-14-20(28-3)26-22(18)27(19)21/h5-7,10-11,13-14H,4,8-9,12,15H2,1-3H3
Reactome pathway
n/an/a 962n/an/an/an/an/an/a
Biotie Therapies GmbH
Curated by ChEMBL
Assay Description
Inhibition of human recombinant PDE10A expressed in baculovirus-SF21 cell system assessed as hydrolysis of [3H]cAMP after 1 hr by liquid scintillatio...
J Med Chem 53: 4399-411 (2010)
Article DOI: 10.1021/jm1002793
BindingDB Entry DOI: 10.7270/Q2MK6D3N