BDBM50319230 6-{3-[1-(2-Diethylamino-ethyl)-1H-benzimidazole-5-carbonyl]-ureido}-hexanoic acid hydroxyamide::CHEMBL1085117
SMILES: CCN(CC)CCn1cnc2cc(ccc12)C(=O)NC(=O)NCCCCCC(=O)NO
InChI Key: InChIKey=MZMRHGDCPYWCCN-UHFFFAOYSA-N
Data: 2 IC50
Activity Spreadsheet -- Enzyme Inhibition Constant Data from BindingDB
Found 2 hits for monomerid = 50319230
Trg + Lig
Ki
nM
ΔG°
kcal/mole
IC50
nM
Kd
nM
EC50/IC50
nM
koff
s-1
kon
M-1s-1
pHTemp
°C
Histone deacetylase 1
(Homo sapiens (Human))
BDBM50319230
(6-{3-[1-(2-Diethylamino-ethyl)-1H-benzimidazole-5-...)
Show SMILES CCN(CC)CCn1cnc2cc(ccc12)C(=O)NC(=O)NCCCCCC(=O)NO
Show InChI InChI=1S/C21H32N6O4/c1-3-26(4-2)12-13-27-15-23-17-14-16(9-10-18(17)27)20(29)24-21(30)22-11-7-5-6-8-19(28)25-31/h9-10,14-15,31H,3-8,11-13H2,1-2H3,(H,25,28)(H2,22,24,29,30)
NCI pathway
Reactome pathway
n/an/a 21n/an/an/an/an/an/a
S *BIO Pte Ltd
Curated by ChEMBL
Assay Description
Inhibition of HDAC1 in human COLO205 cells assessed as induction of histone H3 acetylation
Bioorg Med Chem Lett 20: 3314-21 (2010)
Article DOI: 10.1016/j.bmcl.2010.04.041
BindingDB Entry DOI: 10.7270/Q2GT5NCX
Histone deacetylase 1
(Homo sapiens (Human))
BDBM50319230
(6-{3-[1-(2-Diethylamino-ethyl)-1H-benzimidazole-5-...)
Show SMILES CCN(CC)CCn1cnc2cc(ccc12)C(=O)NC(=O)NCCCCCC(=O)NO
Show InChI InChI=1S/C21H32N6O4/c1-3-26(4-2)12-13-27-15-23-17-14-16(9-10-18(17)27)20(29)24-21(30)22-11-7-5-6-8-19(28)25-31/h9-10,14-15,31H,3-8,11-13H2,1-2H3,(H,25,28)(H2,22,24,29,30)
NCI pathway
Reactome pathway
n/an/a 5.10E+3n/an/an/an/an/an/a
S *BIO Pte Ltd
Curated by ChEMBL
Assay Description
Inhibition of HDAC1 in human COLO205 cells assessed as induction of histone H3 acetylation
Bioorg Med Chem Lett 20: 3314-21 (2010)
Article DOI: 10.1016/j.bmcl.2010.04.041
BindingDB Entry DOI: 10.7270/Q2GT5NCX