BDBM50319262 2-(4-(((2-(2,4-dimethylphenylamino)-2-oxoethyl)(furan-2-ylmethyl)amino)methyl)phenoxy)-2-methylpropanoic acid::CHEMBL1085795
SMILES: Cc1ccc(NC(=O)CN(Cc2ccco2)Cc2ccc(OC(C)(C)C(O)=O)cc2)c(C)c1
InChI Key: InChIKey=OLAPRRPHWILKIM-UHFFFAOYSA-N
Data: 6 EC50
Activity Spreadsheet -- Enzyme Inhibition Constant Data from BindingDB
Found 6 hits for monomerid = 50319262
Trg + Lig
Ki
nM
ΔG°
kcal/mole
IC50
nM
Kd
nM
EC50/IC50
nM
koff
s-1
kon
M-1s-1
pHTemp
°C
Peroxisome proliferator-activated receptor delta
(Homo sapiens (Human))
BDBM50319262
(2-(4-(((2-(2,4-dimethylphenylamino)-2-oxoethyl)(fu...)
Show SMILES Cc1ccc(NC(=O)CN(Cc2ccco2)Cc2ccc(OC(C)(C)C(O)=O)cc2)c(C)c1
Show InChI InChI=1S/C26H30N2O5/c1-18-7-12-23(19(2)14-18)27-24(29)17-28(16-22-6-5-13-32-22)15-20-8-10-21(11-9-20)33-26(3,4)25(30)31/h5-14H,15-17H2,1-4H3,(H,27,29)(H,30,31)
n/an/an/an/a 6.00E+3n/an/an/an/a
Bayer-Schering Pharma
Curated by ChEMBL
Assay Description
Agonist activity at Gal4-fused human PPARdelta
Bioorg Med Chem Lett 20: 3376-9 (2010)
Article DOI: 10.1016/j.bmcl.2010.04.019
BindingDB Entry DOI: 10.7270/Q27944V8
Peroxisome proliferator-activated receptor alpha
(Mus musculus)
BDBM50319262
(2-(4-(((2-(2,4-dimethylphenylamino)-2-oxoethyl)(fu...)
Show SMILES Cc1ccc(NC(=O)CN(Cc2ccco2)Cc2ccc(OC(C)(C)C(O)=O)cc2)c(C)c1
Show InChI InChI=1S/C26H30N2O5/c1-18-7-12-23(19(2)14-18)27-24(29)17-28(16-22-6-5-13-32-22)15-20-8-10-21(11-9-20)33-26(3,4)25(30)31/h5-14H,15-17H2,1-4H3,(H,27,29)(H,30,31)
Reactome pathway
n/an/an/an/a 20n/an/an/an/a
Bayer-Schering Pharma
Curated by ChEMBL
Assay Description
Agonist activity at Gal4-fused mouse PPARalpha
Bioorg Med Chem Lett 20: 3376-9 (2010)
Article DOI: 10.1016/j.bmcl.2010.04.019
BindingDB Entry DOI: 10.7270/Q27944V8
Peroxisome proliferator-activated receptor gamma
(Homo sapiens (Human))
BDBM50319262
(2-(4-(((2-(2,4-dimethylphenylamino)-2-oxoethyl)(fu...)
Show SMILES Cc1ccc(NC(=O)CN(Cc2ccco2)Cc2ccc(OC(C)(C)C(O)=O)cc2)c(C)c1
Show InChI InChI=1S/C26H30N2O5/c1-18-7-12-23(19(2)14-18)27-24(29)17-28(16-22-6-5-13-32-22)15-20-8-10-21(11-9-20)33-26(3,4)25(30)31/h5-14H,15-17H2,1-4H3,(H,27,29)(H,30,31)
NCI pathway
Reactome pathway
n/an/an/an/a 800n/an/an/an/a
Bayer-Schering Pharma
Curated by ChEMBL
Assay Description
Agonist activity at Gal4-fused human PPARgamma
Bioorg Med Chem Lett 20: 3376-9 (2010)
Article DOI: 10.1016/j.bmcl.2010.04.019
BindingDB Entry DOI: 10.7270/Q27944V8
Peroxisome proliferator-activated receptor delta
(Mus musculus)
BDBM50319262
(2-(4-(((2-(2,4-dimethylphenylamino)-2-oxoethyl)(fu...)
Show SMILES Cc1ccc(NC(=O)CN(Cc2ccco2)Cc2ccc(OC(C)(C)C(O)=O)cc2)c(C)c1
Show InChI InChI=1S/C26H30N2O5/c1-18-7-12-23(19(2)14-18)27-24(29)17-28(16-22-6-5-13-32-22)15-20-8-10-21(11-9-20)33-26(3,4)25(30)31/h5-14H,15-17H2,1-4H3,(H,27,29)(H,30,31)
Reactome pathway
n/an/an/an/a 2.00E+3n/an/an/an/a
Bayer-Schering Pharma
Curated by ChEMBL
Assay Description
Agonist activity at Gal4-fused mouse PPARdelta
Bioorg Med Chem Lett 20: 3376-9 (2010)
Article DOI: 10.1016/j.bmcl.2010.04.019
BindingDB Entry DOI: 10.7270/Q27944V8
Peroxisome proliferator-activated receptor alpha
(Homo sapiens (Human))
BDBM50319262
(2-(4-(((2-(2,4-dimethylphenylamino)-2-oxoethyl)(fu...)
Show SMILES Cc1ccc(NC(=O)CN(Cc2ccco2)Cc2ccc(OC(C)(C)C(O)=O)cc2)c(C)c1
Show InChI InChI=1S/C26H30N2O5/c1-18-7-12-23(19(2)14-18)27-24(29)17-28(16-22-6-5-13-32-22)15-20-8-10-21(11-9-20)33-26(3,4)25(30)31/h5-14H,15-17H2,1-4H3,(H,27,29)(H,30,31)
n/an/an/an/a 20n/an/an/an/a
Bayer-Schering Pharma
Curated by ChEMBL
Assay Description
Agonist activity at Gal4-fused human PPARalpha
Bioorg Med Chem Lett 20: 3376-9 (2010)
Article DOI: 10.1016/j.bmcl.2010.04.019
BindingDB Entry DOI: 10.7270/Q27944V8
Peroxisome proliferator-activated receptor gamma
(Mus musculus)
BDBM50319262
(2-(4-(((2-(2,4-dimethylphenylamino)-2-oxoethyl)(fu...)
Show SMILES Cc1ccc(NC(=O)CN(Cc2ccco2)Cc2ccc(OC(C)(C)C(O)=O)cc2)c(C)c1
Show InChI InChI=1S/C26H30N2O5/c1-18-7-12-23(19(2)14-18)27-24(29)17-28(16-22-6-5-13-32-22)15-20-8-10-21(11-9-20)33-26(3,4)25(30)31/h5-14H,15-17H2,1-4H3,(H,27,29)(H,30,31)
Reactome pathway
n/an/an/an/a 300n/an/an/an/a
Bayer-Schering Pharma
Curated by ChEMBL
Assay Description
Agonist activity at Gal4-fused mouse PPARgamma
Bioorg Med Chem Lett 20: 3376-9 (2010)
Article DOI: 10.1016/j.bmcl.2010.04.019
BindingDB Entry DOI: 10.7270/Q27944V8