BDBM50319514 (R)-2,6-dimethyl-5-(6-(2-(2-methylpyrrolidin-1-yl)ethyl)quinolin-2-yl)nicotinonitrile::CHEMBL1085560
SMILES: C[C@@H]1CCCN1CCc1ccc2nc(ccc2c1)-c1cc(C#N)c(C)nc1C
InChI Key: InChIKey=ABCLYDOXFRWKNB-MRXNPFEDSA-N
Data: 4 KI  1 IC50
Activity Spreadsheet -- Enzyme Inhibition Constant Data from BindingDB
Found 5 hits for monomerid = 50319514
Trg + Lig
Ki
nM
ΔG°
kcal/mole
IC50
nM
Kd
nM
EC50/IC50
nM
koff
s-1
kon
M-1s-1
pHTemp
°C
Histamine H3 receptor
(Homo sapiens (Human))
BDBM50319514
((R)-2,6-dimethyl-5-(6-(2-(2-methylpyrrolidin-1-yl)...)
Show SMILES C[C@@H]1CCCN1CCc1ccc2nc(ccc2c1)-c1cc(C#N)c(C)nc1C |r|
Show InChI InChI=1S/C24H26N4/c1-16-5-4-11-28(16)12-10-19-6-8-23-20(13-19)7-9-24(27-23)22-14-21(15-25)17(2)26-18(22)3/h6-9,13-14,16H,4-5,10-12H2,1-3H3/t16-/m1/s1
Reactome pathway
0.280n/an/an/an/an/an/an/an/a
Abbott Laboratories
Curated by ChEMBL
Assay Description
Displacement of [3H]-N-alpha-methylhistamine from human cloned histamine H3 receptor
Bioorg Med Chem Lett 20: 3295-300 (2010)
Article DOI: 10.1016/j.bmcl.2010.04.045
BindingDB Entry DOI: 10.7270/Q2XW4JZN
Histamine H3 receptor
(Homo sapiens (Human))
BDBM50319514
((R)-2,6-dimethyl-5-(6-(2-(2-methylpyrrolidin-1-yl)...)
Show SMILES C[C@@H]1CCCN1CCc1ccc2nc(ccc2c1)-c1cc(C#N)c(C)nc1C |r|
Show InChI InChI=1S/C24H26N4/c1-16-5-4-11-28(16)12-10-19-6-8-23-20(13-19)7-9-24(27-23)22-14-21(15-25)17(2)26-18(22)3/h6-9,13-14,16H,4-5,10-12H2,1-3H3/t16-/m1/s1
Reactome pathway
0.300n/an/an/an/an/an/an/an/a
Bioprojet-Biotech
Curated by ChEMBL
Assay Description
Displacement of [125I]Iodoproxyfan from human recombinant histamine H3 receptor by Competitive binding assay
Bioorg Med Chem Lett 21: 5378-83 (2011)
Article DOI: 10.1016/j.bmcl.2011.07.006
BindingDB Entry DOI: 10.7270/Q2VX0GXK
Histamine H3 receptor
(Rattus norvegicus (rat))
BDBM50319514
((R)-2,6-dimethyl-5-(6-(2-(2-methylpyrrolidin-1-yl)...)
Show SMILES C[C@@H]1CCCN1CCc1ccc2nc(ccc2c1)-c1cc(C#N)c(C)nc1C |r|
Show InChI InChI=1S/C24H26N4/c1-16-5-4-11-28(16)12-10-19-6-8-23-20(13-19)7-9-24(27-23)22-14-21(15-25)17(2)26-18(22)3/h6-9,13-14,16H,4-5,10-12H2,1-3H3/t16-/m1/s1
Reactome pathway
2n/an/an/an/an/an/an/an/a
Abbott Laboratories
Curated by ChEMBL
Assay Description
Displacement of [3H]-N-alpha-methylhistamine from rat cloned histamine H3 receptor
Bioorg Med Chem Lett 20: 3295-300 (2010)
Article DOI: 10.1016/j.bmcl.2010.04.045
BindingDB Entry DOI: 10.7270/Q2XW4JZN
Potassium voltage-gated channel subfamily H member 2
(Homo sapiens (Human))
BDBM50319514
((R)-2,6-dimethyl-5-(6-(2-(2-methylpyrrolidin-1-yl)...)
Show SMILES C[C@@H]1CCCN1CCc1ccc2nc(ccc2c1)-c1cc(C#N)c(C)nc1C |r|
Show InChI InChI=1S/C24H26N4/c1-16-5-4-11-28(16)12-10-19-6-8-23-20(13-19)7-9-24(27-23)22-14-21(15-25)17(2)26-18(22)3/h6-9,13-14,16H,4-5,10-12H2,1-3H3/t16-/m1/s1
Reactome pathway
2.10E+3n/an/an/an/an/an/an/an/a
Abbott Laboratories
Curated by ChEMBL
Assay Description
Displacement of [3H]dofetilide from human ERG expressed in HEK293 cells
Bioorg Med Chem Lett 20: 3295-300 (2010)
Article DOI: 10.1016/j.bmcl.2010.04.045
BindingDB Entry DOI: 10.7270/Q2XW4JZN
Potassium voltage-gated channel subfamily H member 2
(Homo sapiens (Human))
BDBM50319514
((R)-2,6-dimethyl-5-(6-(2-(2-methylpyrrolidin-1-yl)...)
Show SMILES C[C@@H]1CCCN1CCc1ccc2nc(ccc2c1)-c1cc(C#N)c(C)nc1C |r|
Show InChI InChI=1S/C24H26N4/c1-16-5-4-11-28(16)12-10-19-6-8-23-20(13-19)7-9-24(27-23)22-14-21(15-25)17(2)26-18(22)3/h6-9,13-14,16H,4-5,10-12H2,1-3H3/t16-/m1/s1
Reactome pathway
n/an/a 8.40E+3n/an/an/an/an/an/a
Bioprojet-Biotech
Curated by ChEMBL
Assay Description
Displacement of [3H]dofetilide from human recombinant ERG by Competitive binding assay
Bioorg Med Chem Lett 21: 5378-83 (2011)
Article DOI: 10.1016/j.bmcl.2011.07.006
BindingDB Entry DOI: 10.7270/Q2VX0GXK