null
SMILES: C[C@@H]1CCCN1CCc1ccc2nc(ccc2c1)-c1sc(nc1C)-c1cnccn1
InChI Key: InChIKey=GPHSVVRXIKKAFP-MRXNPFEDSA-N
Activity Spreadsheet -- Enzyme Inhibition Constant Data from BindingDB
Found 5 hits for monomerid = 50319541
Trg + Lig
Ki
nM
ΔG°
kcal/mole
IC50
nM
Kd
nM
EC50/IC50
nM
koff
s-1
kon
M-1s-1
pHTemp
°C
Histamine H3 receptor
(Homo sapiens (Human))
BDBM50319541
((R)-4-methyl-5-(6-(2-(2-methylpyrrolidin-1-yl)ethy...)
Show SMILES C[C@@H]1CCCN1CCc1ccc2nc(ccc2c1)-c1sc(nc1C)-c1cnccn1 |r|
Show InChI InChI=1S/C24H25N5S/c1-16-4-3-12-29(16)13-9-18-5-7-20-19(14-18)6-8-21(28-20)23-17(2)27-24(30-23)22-15-25-10-11-26-22/h5-8,10-11,14-16H,3-4,9,12-13H2,1-2H3/t16-/m1/s1
Reactome pathway
0.350n/an/an/an/an/an/an/an/a
Abbott Laboratories
Curated by ChEMBL
Assay Description
Displacement of [3H]-N-alpha-methylhistamine from human cloned histamine H3 receptor
Bioorg Med Chem Lett 20: 3295-300 (2010)
Article DOI: 10.1016/j.bmcl.2010.04.045
BindingDB Entry DOI: 10.7270/Q2XW4JZN
Histamine H3 receptor
(Homo sapiens (Human))
BDBM50319541
((R)-4-methyl-5-(6-(2-(2-methylpyrrolidin-1-yl)ethy...)
Show SMILES C[C@@H]1CCCN1CCc1ccc2nc(ccc2c1)-c1sc(nc1C)-c1cnccn1 |r|
Show InChI InChI=1S/C24H25N5S/c1-16-4-3-12-29(16)13-9-18-5-7-20-19(14-18)6-8-21(28-20)23-17(2)27-24(30-23)22-15-25-10-11-26-22/h5-8,10-11,14-16H,3-4,9,12-13H2,1-2H3/t16-/m1/s1
Reactome pathway
0.350n/an/an/an/an/an/an/an/a
Bioprojet-Biotech
Curated by ChEMBL
Assay Description
Displacement of [125I]Iodoproxyfan from human recombinant histamine H3 receptor by Competitive binding assay
Bioorg Med Chem Lett 21: 5378-83 (2011)
Article DOI: 10.1016/j.bmcl.2011.07.006
BindingDB Entry DOI: 10.7270/Q2VX0GXK
Histamine H3 receptor
(Rattus norvegicus (rat))
BDBM50319541
((R)-4-methyl-5-(6-(2-(2-methylpyrrolidin-1-yl)ethy...)
Show SMILES C[C@@H]1CCCN1CCc1ccc2nc(ccc2c1)-c1sc(nc1C)-c1cnccn1 |r|
Show InChI InChI=1S/C24H25N5S/c1-16-4-3-12-29(16)13-9-18-5-7-20-19(14-18)6-8-21(28-20)23-17(2)27-24(30-23)22-15-25-10-11-26-22/h5-8,10-11,14-16H,3-4,9,12-13H2,1-2H3/t16-/m1/s1
Reactome pathway
1.40n/an/an/an/an/an/an/an/a
Abbott Laboratories
Curated by ChEMBL
Assay Description
Displacement of [3H]-N-alpha-methylhistamine from rat cloned histamine H3 receptor
Bioorg Med Chem Lett 20: 3295-300 (2010)
Article DOI: 10.1016/j.bmcl.2010.04.045
BindingDB Entry DOI: 10.7270/Q2XW4JZN
Potassium voltage-gated channel subfamily H member 2
(Homo sapiens (Human))
BDBM50319541
((R)-4-methyl-5-(6-(2-(2-methylpyrrolidin-1-yl)ethy...)
Show SMILES C[C@@H]1CCCN1CCc1ccc2nc(ccc2c1)-c1sc(nc1C)-c1cnccn1 |r|
Show InChI InChI=1S/C24H25N5S/c1-16-4-3-12-29(16)13-9-18-5-7-20-19(14-18)6-8-21(28-20)23-17(2)27-24(30-23)22-15-25-10-11-26-22/h5-8,10-11,14-16H,3-4,9,12-13H2,1-2H3/t16-/m1/s1
Reactome pathway
7.90E+3n/an/an/an/an/an/an/an/a
Abbott Laboratories
Curated by ChEMBL
Assay Description
Displacement of [3H]dofetilide from human ERG expressed in HEK293 cells
Bioorg Med Chem Lett 20: 3295-300 (2010)
Article DOI: 10.1016/j.bmcl.2010.04.045
BindingDB Entry DOI: 10.7270/Q2XW4JZN
Potassium voltage-gated channel subfamily H member 2
(Homo sapiens (Human))
BDBM50319541
((R)-4-methyl-5-(6-(2-(2-methylpyrrolidin-1-yl)ethy...)
Show SMILES C[C@@H]1CCCN1CCc1ccc2nc(ccc2c1)-c1sc(nc1C)-c1cnccn1 |r|
Show InChI InChI=1S/C24H25N5S/c1-16-4-3-12-29(16)13-9-18-5-7-20-19(14-18)6-8-21(28-20)23-17(2)27-24(30-23)22-15-25-10-11-26-22/h5-8,10-11,14-16H,3-4,9,12-13H2,1-2H3/t16-/m1/s1
Reactome pathway
n/an/a 3.20E+4n/an/an/an/an/an/a
Bioprojet-Biotech
Curated by ChEMBL
Assay Description
Displacement of [3H]dofetilide from human recombinant ERG by Competitive binding assay
Bioorg Med Chem Lett 21: 5378-83 (2011)
Article DOI: 10.1016/j.bmcl.2011.07.006
BindingDB Entry DOI: 10.7270/Q2VX0GXK