BDBM50319643 CHEMBL1085345::N-(4-oxo-3,4-dihydroquinazolin-8-yl)-2-phenylacetamide
SMILES: O=C(Cc1ccccc1)Nc1cccc2c1nc[nH]c2=O
InChI Key: InChIKey=HFIBQKCXZNHFOU-UHFFFAOYSA-N
Data: 1 IC50
Activity Spreadsheet -- Enzyme Inhibition Constant Data from BindingDB
Found 1 hit for monomerid = 50319643
Trg + Lig
Ki
nM
ΔG°
kcal/mole
IC50
nM
Kd
nM
EC50/IC50
nM
koff
s-1
kon
M-1s-1
pHTemp
°C
Rho-associated protein kinase 2
(Homo sapiens (Human))
BDBM50319643
(CHEMBL1085345 | N-(4-oxo-3,4-dihydroquinazolin-8-y...)
Show SMILES O=C(Cc1ccccc1)Nc1cccc2c1nc[nH]c2=O
Show InChI InChI=1S/C16H13N3O2/c20-14(9-11-5-2-1-3-6-11)19-13-8-4-7-12-15(13)17-10-18-16(12)21/h1-8,10H,9H2,(H,19,20)(H,17,18,21)
n/an/a>1.00E+4n/an/an/an/an/an/a
Boehringer Ingelheim Pharmaceuticals
Curated by ChEMBL
Assay Description
Inhibition of ROCK2
Bioorg Med Chem Lett 20: 3235-9 (2010)
Article DOI: 10.1016/j.bmcl.2010.04.070
BindingDB Entry DOI: 10.7270/Q21N819Z