BDBM50319658 (S)-2-amino-N-(7-chloro-1-oxo-1,2-dihydroisoquinolin-6-yl)-3-phenylpropanamide::CHEMBL1083132
SMILES: N[C@@H](Cc1ccccc1)C(=O)Nc1cc2cc[nH]c(=O)c2cc1Cl
InChI Key: InChIKey=MPPLZNXMOACWRV-HNNXBMFYSA-N
Data: 1 IC50
Activity Spreadsheet -- Enzyme Inhibition Constant Data from BindingDB
Found 1 hit for monomerid = 50319658
Trg + Lig
Ki
nM
ΔG°
kcal/mole
IC50
nM
Kd
nM
EC50/IC50
nM
koff
s-1
kon
M-1s-1
pHTemp
°C
Rho-associated protein kinase 2
(Homo sapiens (Human))
BDBM50319658
((S)-2-amino-N-(7-chloro-1-oxo-1,2-dihydroisoquinol...)
Show SMILES N[C@@H](Cc1ccccc1)C(=O)Nc1cc2cc[nH]c(=O)c2cc1Cl |r|
Show InChI InChI=1S/C18H16ClN3O2/c19-14-10-13-12(6-7-21-17(13)23)9-16(14)22-18(24)15(20)8-11-4-2-1-3-5-11/h1-7,9-10,15H,8,20H2,(H,21,23)(H,22,24)/t15-/m0/s1
n/an/a 48n/an/an/an/an/an/a
Boehringer Ingelheim Pharmaceuticals
Curated by ChEMBL
Assay Description
Inhibition of ROCK2
Bioorg Med Chem Lett 20: 3235-9 (2010)
Article DOI: 10.1016/j.bmcl.2010.04.070
BindingDB Entry DOI: 10.7270/Q21N819Z