null
SMILES: CN1C[C@@H]2C[C@H]1CN2c1ccc(cn1)-c1ccc2[nH]ncc2c1
InChI Key: InChIKey=ITIAUUGMGIVTSE-HOTGVXAUSA-N
Activity Spreadsheet -- Enzyme Inhibition Constant Data from BindingDB
Found 3 hits for monomerid = 50319963
Trg + Lig
Ki
nM
ΔG°
kcal/mole
IC50
nM
Kd
nM
EC50/IC50
nM
koff
s-1
kon
M-1s-1
pHTemp
°C
Neuronal acetylcholine receptor subunit alpha-7
(Rattus norvegicus (Rat))
BDBM50319963
(5-(6-((1S,4S)-5-methyl-2,5-diazabicyclo[2.2.1]hept...)
Show SMILES CN1C[C@@H]2C[C@H]1CN2c1ccc(cn1)-c1ccc2[nH]ncc2c1 |r|
Show InChI InChI=1S/C18H19N5/c1-22-10-16-7-15(22)11-23(16)18-5-3-13(8-19-18)12-2-4-17-14(6-12)9-20-21-17/h2-6,8-9,15-16H,7,10-11H2,1H3,(H,20,21)/t15-,16-/m0/s1
Reactome pathway
0.300n/an/an/an/an/an/an/an/a
Abbott Park
Curated by ChEMBL
Assay Description
Displacement of [3H]A585539 from alpha7 nACHR in rat brain homogenate
Bioorg Med Chem Lett 20: 3636-9 (2010)
Article DOI: 10.1016/j.bmcl.2010.04.105
BindingDB Entry DOI: 10.7270/Q2MC905N
Potassium voltage-gated channel subfamily H member 2
(Homo sapiens (Human))
BDBM50319963
(5-(6-((1S,4S)-5-methyl-2,5-diazabicyclo[2.2.1]hept...)
Show SMILES CN1C[C@@H]2C[C@H]1CN2c1ccc(cn1)-c1ccc2[nH]ncc2c1 |r|
Show InChI InChI=1S/C18H19N5/c1-22-10-16-7-15(22)11-23(16)18-5-3-13(8-19-18)12-2-4-17-14(6-12)9-20-21-17/h2-6,8-9,15-16H,7,10-11H2,1H3,(H,20,21)/t15-,16-/m0/s1
Reactome pathway
46n/an/an/an/an/an/an/an/a
Abbott Park
Curated by ChEMBL
Assay Description
Displacement of [3H]dofetidile from human ERG by whole-cell patch clamp
Bioorg Med Chem Lett 20: 3636-9 (2010)
Article DOI: 10.1016/j.bmcl.2010.04.105
BindingDB Entry DOI: 10.7270/Q2MC905N
Neuronal acetylcholine receptor subunit alpha-7
(Homo sapiens (Human))
BDBM50319963
(5-(6-((1S,4S)-5-methyl-2,5-diazabicyclo[2.2.1]hept...)
Show SMILES CN1C[C@@H]2C[C@H]1CN2c1ccc(cn1)-c1ccc2[nH]ncc2c1 |r|
Show InChI InChI=1S/C18H19N5/c1-22-10-16-7-15(22)11-23(16)18-5-3-13(8-19-18)12-2-4-17-14(6-12)9-20-21-17/h2-6,8-9,15-16H,7,10-11H2,1H3,(H,20,21)/t15-,16-/m0/s1
n/an/an/an/a 300n/an/an/an/a
Abbott Park
Curated by ChEMBL
Assay Description
Agonist activity at human alpha7 nACHR expressed in Xenopus oocyte assessed as activation of current by voltage clamp method
Bioorg Med Chem Lett 20: 3636-9 (2010)
Article DOI: 10.1016/j.bmcl.2010.04.105
BindingDB Entry DOI: 10.7270/Q2MC905N