null
SMILES: CC(OC[C@H](O)CNC(C)(C)Cc1ccc2ccccc2c1)c1cccc2ccccc12
InChI Key: InChIKey=JUIIDRHWLOGTIP-ZTDHTWSHSA-N
Activity Spreadsheet -- Enzyme Inhibition Constant Data from BindingDB
Found 1 hit for monomerid = 50319997
Trg + Lig
Ki
nM
ΔG°
kcal/mole
IC50
nM
Kd
nM
EC50/IC50
nM
koff
s-1
kon
M-1s-1
pHTemp
°C
Extracellular calcium-sensing receptor
(Homo sapiens (Human))
BDBM50319997
((2R)-1-(2-methyl-1-(naphthalen-2-yl)propan-2-ylami...)
Show SMILES CC(OC[C@H](O)CNC(C)(C)Cc1ccc2ccccc2c1)c1cccc2ccccc12 |r|
Show InChI InChI=1S/C29H33NO2/c1-21(27-14-8-12-24-10-6-7-13-28(24)27)32-20-26(31)19-30-29(2,3)18-22-15-16-23-9-4-5-11-25(23)17-22/h4-17,21,26,30-31H,18-20H2,1-3H3/t21?,26-/m1/s1
n/an/a 360n/an/an/an/an/an/a
Central Pharmaceutical Research Institute
Curated by ChEMBL
Assay Description
Antagonist activity at human CaSR expressed in rat PC12 cells transfected with zif promoter/luciferase by reporter gene assay
Bioorg Med Chem Lett 20: 3809-13 (2010)
Article DOI: 10.1016/j.bmcl.2010.04.035
BindingDB Entry DOI: 10.7270/Q2765FGD