null
SMILES: CC(OC[C@H](O)CNC(C)(C)Cc1ccc2ccccc2c1)c1cccc(C)c1
InChI Key: InChIKey=GPEAFQZQRRGIAR-GBAXHLBXSA-N
Activity Spreadsheet -- Enzyme Inhibition Constant Data from BindingDB
Found 1 hit for monomerid = 50320006
Trg + Lig
Ki
nM
ΔG°
kcal/mole
IC50
nM
Kd
nM
EC50/IC50
nM
koff
s-1
kon
M-1s-1
pHTemp
°C
Extracellular calcium-sensing receptor
(Homo sapiens (Human))
BDBM50320006
((2R)-1-(2-methyl-1-(naphthalen-2-yl)propan-2-ylami...)
Show SMILES CC(OC[C@H](O)CNC(C)(C)Cc1ccc2ccccc2c1)c1cccc(C)c1 |r|
Show InChI InChI=1S/C26H33NO2/c1-19-8-7-11-23(14-19)20(2)29-18-25(28)17-27-26(3,4)16-21-12-13-22-9-5-6-10-24(22)15-21/h5-15,20,25,27-28H,16-18H2,1-4H3/t20?,25-/m1/s1
n/an/a 170n/an/an/an/an/an/a
Central Pharmaceutical Research Institute
Curated by ChEMBL
Assay Description
Antagonist activity at human CaSR expressed in rat PC12 cells transfected with zif promoter/luciferase by reporter gene assay
Bioorg Med Chem Lett 20: 3809-13 (2010)
Article DOI: 10.1016/j.bmcl.2010.04.035
BindingDB Entry DOI: 10.7270/Q2765FGD