null
SMILES: COc1ccccc1C(C)OC[C@H](O)CNC(C)(C)Cc1ccc2ccccc2c1
InChI Key: InChIKey=STGPXBMWVQSDIL-LEQGEALCSA-N
Activity Spreadsheet -- Enzyme Inhibition Constant Data from BindingDB
Found 1 hit for monomerid = 50320008
Trg + Lig
Ki
nM
ΔG°
kcal/mole
IC50
nM
Kd
nM
EC50/IC50
nM
koff
s-1
kon
M-1s-1
pHTemp
°C
Extracellular calcium-sensing receptor
(Homo sapiens (Human))
BDBM50320008
((2R)-1-(1-(2-methoxyphenyl)ethoxy)-3-(2-methyl-1-(...)
Show SMILES COc1ccccc1C(C)OC[C@H](O)CNC(C)(C)Cc1ccc2ccccc2c1 |r|
Show InChI InChI=1S/C26H33NO3/c1-19(24-11-7-8-12-25(24)29-4)30-18-23(28)17-27-26(2,3)16-20-13-14-21-9-5-6-10-22(21)15-20/h5-15,19,23,27-28H,16-18H2,1-4H3/t19?,23-/m1/s1
n/an/a 120n/an/an/an/an/an/a
Central Pharmaceutical Research Institute
Curated by ChEMBL
Assay Description
Antagonist activity at human CaSR expressed in rat PC12 cells transfected with zif promoter/luciferase by reporter gene assay
Bioorg Med Chem Lett 20: 3809-13 (2010)
Article DOI: 10.1016/j.bmcl.2010.04.035
BindingDB Entry DOI: 10.7270/Q2765FGD