null
SMILES: CC(C)(Cc1ccc2ccccc2c1)NC[C@@H](O)COC(C1CCCCC1)c1ccccc1
InChI Key: InChIKey=ARXWWLXUEVSQKA-FICMROCWSA-N
Activity Spreadsheet -- Enzyme Inhibition Constant Data from BindingDB
Found 1 hit for monomerid = 50320014
Trg + Lig
Ki
nM
ΔG°
kcal/mole
IC50
nM
Kd
nM
EC50/IC50
nM
koff
s-1
kon
M-1s-1
pHTemp
°C
Extracellular calcium-sensing receptor
(Homo sapiens (Human))
BDBM50320014
((2R)-1-(cyclohexyl(phenyl)methoxy)-3-(2-methyl-1-(...)
Show SMILES CC(C)(Cc1ccc2ccccc2c1)NC[C@@H](O)COC(C1CCCCC1)c1ccccc1 |r|
Show InChI InChI=1S/C30H39NO2/c1-30(2,20-23-17-18-24-11-9-10-16-27(24)19-23)31-21-28(32)22-33-29(25-12-5-3-6-13-25)26-14-7-4-8-15-26/h3,5-6,9-13,16-19,26,28-29,31-32H,4,7-8,14-15,20-22H2,1-2H3/t28-,29?/m1/s1
n/an/a 610n/an/an/an/an/an/a
Central Pharmaceutical Research Institute
Curated by ChEMBL
Assay Description
Antagonist activity at human CaSR expressed in rat PC12 cells transfected with zif promoter/luciferase by reporter gene assay
Bioorg Med Chem Lett 20: 3809-13 (2010)
Article DOI: 10.1016/j.bmcl.2010.04.035
BindingDB Entry DOI: 10.7270/Q2765FGD