BDBM50320825 6-O-beta-D-glucopyranosyl-2,3-dideoxy-beta-1-C-ethyl-1-deoxygalactonojirimycin::CHEMBL1163254
SMILES: CC[C@H]1CC[C@@H](O)[C@@H](CO[C@@H]2O[C@H](CO)[C@@H](O)[C@H](O)[C@H]2O)N1
InChI Key: InChIKey=NIFSXMTZZIQERU-UKZTVZDSSA-N
Data: 3 IC50
Activity Spreadsheet -- Enzyme Inhibition Constant Data from BindingDB
Found 3 hits for monomerid = 50320825
Trg + Lig
Ki
nM
ΔG°
kcal/mole
IC50
nM
Kd
nM
EC50/IC50
nM
koff
s-1
kon
M-1s-1
pHTemp
°C
Probable alpha-glucosidase Os06g0675700
(Oryza sativa subsp. japonica)
BDBM50320825
(6-O-beta-D-glucopyranosyl-2,3-dideoxy-beta-1-C-eth...)
Show SMILES CC[C@H]1CC[C@@H](O)[C@@H](CO[C@@H]2O[C@H](CO)[C@@H](O)[C@H](O)[C@H]2O)N1 |r|
Show InChI InChI=1S/C14H27NO7/c1-2-7-3-4-9(17)8(15-7)6-21-14-13(20)12(19)11(18)10(5-16)22-14/h7-20H,2-6H2,1H3/t7-,8+,9+,10+,11+,12-,13+,14+/m0/s1
Reactome pathway
n/an/a 6.70E+5n/an/an/an/a5.0n/a
University of Toyama
Curated by ChEMBL
Assay Description
Inhibition of rice alpha-glucosidase assessed as D-glucose release at pH 5 after 10 to 30 mins
Bioorg Med Chem 18: 3790-4 (2010)
Article DOI: 10.1016/j.bmc.2010.04.048
BindingDB Entry DOI: 10.7270/Q2XK8FQP
Alpha-glucosidase A (α-Gal A)
(Homo sapiens (Human))
BDBM50320825
(6-O-beta-D-glucopyranosyl-2,3-dideoxy-beta-1-C-eth...)
Show SMILES CC[C@H]1CC[C@@H](O)[C@@H](CO[C@@H]2O[C@H](CO)[C@@H](O)[C@H](O)[C@H]2O)N1 |r|
Show InChI InChI=1S/C14H27NO7/c1-2-7-3-4-9(17)8(15-7)6-21-14-13(20)12(19)11(18)10(5-16)22-14/h7-20H,2-6H2,1H3/t7-,8+,9+,10+,11+,12-,13+,14+/m0/s1
Reactome pathway
n/an/a 2.24E+5n/an/an/an/an/an/a
University of Toyama
Curated by ChEMBL
Assay Description
Inhibition of human lysosome alpha-galactosidase assessed as p-nitrophenol release by spectrometric analysis
Bioorg Med Chem 18: 3790-4 (2010)
Article DOI: 10.1016/j.bmc.2010.04.048
BindingDB Entry DOI: 10.7270/Q2XK8FQP
α-galactosidase
(Coffea arabica (Coffee beans))
BDBM50320825
(6-O-beta-D-glucopyranosyl-2,3-dideoxy-beta-1-C-eth...)
Show SMILES CC[C@H]1CC[C@@H](O)[C@@H](CO[C@@H]2O[C@H](CO)[C@@H](O)[C@H](O)[C@H]2O)N1 |r|
Show InChI InChI=1S/C14H27NO7/c1-2-7-3-4-9(17)8(15-7)6-21-14-13(20)12(19)11(18)10(5-16)22-14/h7-20H,2-6H2,1H3/t7-,8+,9+,10+,11+,12-,13+,14+/m0/s1
n/an/a 3.18E+5n/an/an/an/a6.5n/a
University of Toyama
Curated by ChEMBL
Assay Description
Inhibition of coffee bean alpha-galactosidase assessed as p-nitrophenol release at pH 6.5 by spectrometric analysis
Bioorg Med Chem 18: 3790-4 (2010)
Article DOI: 10.1016/j.bmc.2010.04.048
BindingDB Entry DOI: 10.7270/Q2XK8FQP