BDBM50321112 3-Amino-2-(trifluoromethyl)quinazolin-4(3H)-one::CHEMBL1163157
SMILES: Nn1c(nc2ccccc2c1=O)C(F)(F)F
InChI Key: InChIKey=VPEPFURGPALIFC-UHFFFAOYSA-N
Data: 1 KI  1 IC50
Activity Spreadsheet -- Enzyme Inhibition Constant Data from BindingDB
Found 2 hits for monomerid = 50321112
Trg + Lig
Ki
nM
ΔG°
kcal/mole
IC50
nM
Kd
nM
EC50/IC50
nM
koff
s-1
kon
M-1s-1
pHTemp
°C
Thermolysin
(Bacillus thermoproteolyticus)
BDBM50321112
(3-Amino-2-(trifluoromethyl)quinazolin-4(3H)-one | ...)
Show SMILES Nn1c(nc2ccccc2c1=O)C(F)(F)F
Show InChI InChI=1S/C9H6F3N3O/c10-9(11,12)8-14-6-4-2-1-3-5(6)7(16)15(8)13/h1-4H,13H2
3.79E+4n/an/an/an/an/an/an/an/a
University of Troms£
Curated by ChEMBL
Assay Description
Inhibition of Bacillus thermoproteolyticus thermolysin after 15 mins by microplate fluorescence analysis in presence of 0.5 to 2 mM substrate FaGLa
Bioorg Med Chem 18: 4317-27 (2010)
Article DOI: 10.1016/j.bmc.2010.04.083
BindingDB Entry DOI: 10.7270/Q2QV3MP9
Thermolysin
(Bacillus thermoproteolyticus)
BDBM50321112
(3-Amino-2-(trifluoromethyl)quinazolin-4(3H)-one | ...)
Show SMILES Nn1c(nc2ccccc2c1=O)C(F)(F)F
Show InChI InChI=1S/C9H6F3N3O/c10-9(11,12)8-14-6-4-2-1-3-5(6)7(16)15(8)13/h1-4H,13H2
n/an/a 3.79E+4n/an/an/an/an/an/a
University of Troms£
Curated by ChEMBL
Assay Description
Inhibition of Bacillus thermoproteolyticus thermolysin after 15 mins by microplate fluorescence analysis in presence of 0.1 M substrate FaGLa
Bioorg Med Chem 18: 4317-27 (2010)
Article DOI: 10.1016/j.bmc.2010.04.083
BindingDB Entry DOI: 10.7270/Q2QV3MP9