BDBM50321300 (2S,3R,4R,5S,6R)-2-(4-chloro-5-(4-ethoxybenzyl)-2-(2-methoxyethyl)phenyl)-6-(hydroxymethyl)tetrahydro-2H-pyran-3,4,5-triol::CHEMBL1163912
SMILES: CCOc1ccc(Cc2cc([C@@H]3O[C@H](CO)[C@@H](O)[C@H](O)[C@H]3O)c(CCOC)cc2Cl)cc1
InChI Key: InChIKey=NDLMOXQJUYAWCC-SJSRKZJXSA-N
Data: 2 IC50
Activity Spreadsheet -- Enzyme Inhibition Constant Data from BindingDB
Found 2 hits for monomerid = 50321300
Trg + Lig
Ki
nM
ΔG°
kcal/mole
IC50
nM
Kd
nM
EC50/IC50
nM
koff
s-1
kon
M-1s-1
pHTemp
°C
Sodium/glucose cotransporter 1 (SGLT1)
(Homo sapiens (Human))
BDBM50321300
((2S,3R,4R,5S,6R)-2-(4-chloro-5-(4-ethoxybenzyl)-2-...)
Show SMILES CCOc1ccc(Cc2cc([C@@H]3O[C@H](CO)[C@@H](O)[C@H](O)[C@H]3O)c(CCOC)cc2Cl)cc1 |r|
Show InChI InChI=1S/C24H31ClO7/c1-3-31-17-6-4-14(5-7-17)10-16-11-18(15(8-9-30-2)12-19(16)25)24-23(29)22(28)21(27)20(13-26)32-24/h4-7,11-12,20-24,26-29H,3,8-10,13H2,1-2H3/t20-,21-,22+,23-,24+/m1/s1
n/an/a>2.00E+3n/an/an/an/an/an/a
Chinese Academy of Sciences
Curated by ChEMBL
Assay Description
Inhibition of human SGLT1 expressed in african green monkey COS7 cells assessed as inhibition of [14C]-alpha-methyl-D-glucopyranoside uptake after 2 ...
Bioorg Med Chem 18: 4422-32 (2010)
Article DOI: 10.1016/j.bmc.2010.04.088
BindingDB Entry DOI: 10.7270/Q2TM7B8N
Sodium/glucose cotransporter 2
(Homo sapiens (Human))
BDBM50321300
((2S,3R,4R,5S,6R)-2-(4-chloro-5-(4-ethoxybenzyl)-2-...)
Show SMILES CCOc1ccc(Cc2cc([C@@H]3O[C@H](CO)[C@@H](O)[C@H](O)[C@H]3O)c(CCOC)cc2Cl)cc1 |r|
Show InChI InChI=1S/C24H31ClO7/c1-3-31-17-6-4-14(5-7-17)10-16-11-18(15(8-9-30-2)12-19(16)25)24-23(29)22(28)21(27)20(13-26)32-24/h4-7,11-12,20-24,26-29H,3,8-10,13H2,1-2H3/t20-,21-,22+,23-,24+/m1/s1
n/an/a 0.900n/an/an/an/an/an/a
Chinese Academy of Sciences
Curated by ChEMBL
Assay Description
Inhibition of human SGLT2 expressed in HEK293 cells assessed as inhibition of [14C]-alpha-methyl-D-glucopyranoside uptake after 1.5 hrs by liquid sci...
Bioorg Med Chem 18: 4422-32 (2010)
Article DOI: 10.1016/j.bmc.2010.04.088
BindingDB Entry DOI: 10.7270/Q2TM7B8N