BDBM50321373 4-cyano-N-(4-(2-(cyanoimino)-1,3-dimethylhexahydropyrimidin-5-yl)-2-(4,4-dimethylcyclohex-1-enyl)phenyl)-1H-imidazole-2-carboxamide::CHEMBL1169979
SMILES: CN1CC(CN(C)C1=NC#N)c1ccc(NC(=O)c2ncc([nH]2)C#N)c(c1)C1=CCC(C)(C)CC1
InChI Key: InChIKey=LTYFCBHZCORHHY-UHFFFAOYSA-N
Data: 1 IC50
Activity Spreadsheet -- Enzyme Inhibition Constant Data from BindingDB
Found 1 hit for monomerid = 50321373
Trg + Lig
Ki
nM
ΔG°
kcal/mole
IC50
nM
Kd
nM
EC50/IC50
nM
koff
s-1
kon
M-1s-1
pHTemp
°C
Macrophage colony stimulating factor receptor
(Homo sapiens (Human))
BDBM50321373
(4-cyano-N-(4-(2-(cyanoimino)-1,3-dimethylhexahydro...)
Show SMILES CN1CC(CN(C)C1=NC#N)c1ccc(NC(=O)c2ncc([nH]2)C#N)c(c1)C1=CCC(C)(C)CC1 |t:30|
Show InChI InChI=1S/C26H30N8O/c1-26(2)9-7-17(8-10-26)21-11-18(19-14-33(3)25(30-16-28)34(4)15-19)5-6-22(21)32-24(35)23-29-13-20(12-27)31-23/h5-7,11,13,19H,8-10,14-15H2,1-4H3,(H,29,31)(H,32,35)
n/an/a 0.400n/an/an/an/an/an/a
Johnson& Johnson Pharmaceutical Research& Development
Curated by ChEMBL
Assay Description
Inhibition of human FMS by fluorescence polarization
Bioorg Med Chem Lett 20: 3925-9 (2010)
Article DOI: 10.1016/j.bmcl.2010.05.013
BindingDB Entry DOI: 10.7270/Q22Z16HG