BDBM50321586 1-(2-(2-isopropylphenyl)benzofuran-7-yl)-3-(4-pentylphenyl)urea::CHEMBL1169909
SMILES: CCCCCc1ccc(NC(=O)Nc2cccc3cc(oc23)-c2ccccc2C(C)C)cc1
InChI Key: InChIKey=ASCJIAKBYVUVNZ-UHFFFAOYSA-N
Data: 1 KI  1 IC50
Activity Spreadsheet -- Enzyme Inhibition Constant Data from BindingDB
Found 2 hits for monomerid = 50321586
Trg + Lig
Ki
nM
ΔG°
kcal/mole
IC50
nM
Kd
nM
EC50/IC50
nM
koff
s-1
kon
M-1s-1
pHTemp
°C
Purinergic receptor P2Y1
(Homo sapiens (Human))
BDBM50321586
(1-(2-(2-isopropylphenyl)benzofuran-7-yl)-3-(4-pent...)
Show SMILES CCCCCc1ccc(NC(=O)Nc2cccc3cc(oc23)-c2ccccc2C(C)C)cc1
Show InChI InChI=1S/C29H32N2O2/c1-4-5-6-10-21-15-17-23(18-16-21)30-29(32)31-26-14-9-11-22-19-27(33-28(22)26)25-13-8-7-12-24(25)20(2)3/h7-9,11-20H,4-6,10H2,1-3H3,(H2,30,31,32)
140n/an/an/an/an/an/an/an/a
GlaxoSmithKline
Curated by ChEMBL
Assay Description
Displacement of [33P]2-MeS-ADP from human P2Y1 receptor expressed in human U2OS cells by scintillation counting
Bioorg Med Chem Lett 20: 4104-7 (2010)
Article DOI: 10.1016/j.bmcl.2010.05.072
BindingDB Entry DOI: 10.7270/Q2HX1DNF
Purinergic receptor P2Y1
(Homo sapiens (Human))
BDBM50321586
(1-(2-(2-isopropylphenyl)benzofuran-7-yl)-3-(4-pent...)
Show SMILES CCCCCc1ccc(NC(=O)Nc2cccc3cc(oc23)-c2ccccc2C(C)C)cc1
Show InChI InChI=1S/C29H32N2O2/c1-4-5-6-10-21-15-17-23(18-16-21)30-29(32)31-26-14-9-11-22-19-27(33-28(22)26)25-13-8-7-12-24(25)20(2)3/h7-9,11-20H,4-6,10H2,1-3H3,(H2,30,31,32)
n/an/a 630n/an/an/an/an/an/a
GlaxoSmithKline
Curated by ChEMBL
Assay Description
Antagonist activity at P2Y1 expressed in HEK293 cells by FLIPR assay
Bioorg Med Chem Lett 20: 4104-7 (2010)
Article DOI: 10.1016/j.bmcl.2010.05.072
BindingDB Entry DOI: 10.7270/Q2HX1DNF