BDBM50321824 4-((1H-Imidazol-4-yl)methyl)-1-(4-isopropylphenyl)piperidine::CHEMBL1172712
SMILES: CC(C)c1ccc(cc1)N1CCC(Cc2cnc[nH]2)CC1
InChI Key: InChIKey=RZCPYANRTWAKSO-UHFFFAOYSA-N
Data: 1 KI  1 EC50
Activity Spreadsheet -- Enzyme Inhibition Constant Data from BindingDB
Found 2 hits for monomerid = 50321824
Trg + Lig
Ki
nM
ΔG°
kcal/mole
IC50
nM
Kd
nM
EC50/IC50
nM
koff
s-1
kon
M-1s-1
pHTemp
°C
Histamine H3 receptor
(Homo sapiens (Human))
BDBM50321824
(4-((1H-Imidazol-4-yl)methyl)-1-(4-isopropylphenyl)...)
Show SMILES CC(C)c1ccc(cc1)N1CCC(Cc2cnc[nH]2)CC1
Show InChI InChI=1S/C18H25N3/c1-14(2)16-3-5-18(6-4-16)21-9-7-15(8-10-21)11-17-12-19-13-20-17/h3-6,12-15H,7-11H2,1-2H3,(H,19,20)
Reactome pathway
14n/an/an/an/an/an/an/an/a
Meiji Seika Kaisha, Ltd
Curated by ChEMBL
Assay Description
Displacement of [3H] (R)-alpha-methylhistamine from human recombinant histamine H3 receptor expressed in CHO cells after 1 hr by liquid scintillation...
Bioorg Med Chem 18: 5441-8 (2010)
Article DOI: 10.1016/j.bmc.2010.04.052
BindingDB Entry DOI: 10.7270/Q2C82B88
Histamine H3 receptor
(Homo sapiens (Human))
BDBM50321824
(4-((1H-Imidazol-4-yl)methyl)-1-(4-isopropylphenyl)...)
Show SMILES CC(C)c1ccc(cc1)N1CCC(Cc2cnc[nH]2)CC1
Show InChI InChI=1S/C18H25N3/c1-14(2)16-3-5-18(6-4-16)21-9-7-15(8-10-21)11-17-12-19-13-20-17/h3-6,12-15H,7-11H2,1-2H3,(H,19,20)
Reactome pathway
n/an/an/an/a 12n/an/an/an/a
Meiji Seika Kaisha, Ltd
Curated by ChEMBL
Assay Description
Agonist activity at human recombinant histamine H3 receptor expressed in CHO-K1 cells assessed as [35S]GTPgammaS binding after 1 hr by liquid scintil...
Bioorg Med Chem 18: 5441-8 (2010)
Article DOI: 10.1016/j.bmc.2010.04.052
BindingDB Entry DOI: 10.7270/Q2C82B88