BDBM50321855 8-{4-Bromo-5-[4-(trifluoromethyl)phenyl]oxazol-2-ylamino}-1,2,3,4-tetrahydronaphthalen-2-ol::CHEMBL1172975
SMILES: OC1CCc2cccc(Nc3nc(Br)c(o3)-c3ccc(cc3)C(F)(F)F)c2C1
InChI Key: InChIKey=UNUKLCQFLQMDAD-UHFFFAOYSA-N
Data: 1 IC50
Activity Spreadsheet -- Enzyme Inhibition Constant Data from BindingDB
Found 1 hit for monomerid = 50321855
Trg + Lig
Ki
nM
ΔG°
kcal/mole
IC50
nM
Kd
nM
EC50/IC50
nM
koff
s-1
kon
M-1s-1
pHTemp
°C
Transient receptor potential cation channel subfamily V member 1
(Homo sapiens (Human))
BDBM50321855
(8-{4-Bromo-5-[4-(trifluoromethyl)phenyl]oxazol-2-y...)
Show SMILES OC1CCc2cccc(Nc3nc(Br)c(o3)-c3ccc(cc3)C(F)(F)F)c2C1
Show InChI InChI=1S/C20H16BrF3N2O2/c21-18-17(12-4-7-13(8-5-12)20(22,23)24)28-19(26-18)25-16-3-1-2-11-6-9-14(27)10-15(11)16/h1-5,7-8,14,27H,6,9-10H2,(H,25,26)
Reactome pathway
n/an/a 9n/an/an/an/an/an/a
Abbott Laboratories
Curated by ChEMBL
Assay Description
Antagonist activity at human recombinant TRPV1 receptor expressed in human 1321 cells assessed as inhibition of capsaicin-induced in intracellular ca...
Bioorg Med Chem 18: 4821-9 (2011)
Article DOI: 10.1016/j.bmc.2010.04.099
BindingDB Entry DOI: 10.7270/Q27H1KJJ