BDBM50321857 8-{4-(4-Fluorophenyl)-5-[4-(trifluoromethyl)phenyl]oxazol-2-ylamino}-1,2,3,4-tetrahydronaphthalen-2-ol::CHEMBL1173756
SMILES: OC1CCc2cccc(Nc3nc(c(o3)-c3ccc(cc3)C(F)(F)F)-c3ccc(F)cc3)c2C1
InChI Key: InChIKey=ILPRVNDOZVRMRI-UHFFFAOYSA-N
Data: 1 IC50
Activity Spreadsheet -- Enzyme Inhibition Constant Data from BindingDB
Found 1 hit for monomerid = 50321857
Trg + Lig
Ki
nM
ΔG°
kcal/mole
IC50
nM
Kd
nM
EC50/IC50
nM
koff
s-1
kon
M-1s-1
pHTemp
°C
Transient receptor potential cation channel subfamily V member 1
(Homo sapiens (Human))
BDBM50321857
(8-{4-(4-Fluorophenyl)-5-[4-(trifluoromethyl)phenyl...)
Show SMILES OC1CCc2cccc(Nc3nc(c(o3)-c3ccc(cc3)C(F)(F)F)-c3ccc(F)cc3)c2C1
Show InChI InChI=1S/C26H20F4N2O2/c27-19-11-6-16(7-12-19)23-24(17-4-9-18(10-5-17)26(28,29)30)34-25(32-23)31-22-3-1-2-15-8-13-20(33)14-21(15)22/h1-7,9-12,20,33H,8,13-14H2,(H,31,32)
Reactome pathway
n/an/a 1.30n/an/an/an/an/an/a
Abbott Laboratories
Curated by ChEMBL
Assay Description
Antagonist activity at human recombinant TRPV1 receptor expressed in human 1321 cells assessed as inhibition of capsaicin-induced in intracellular ca...
Bioorg Med Chem 18: 4821-9 (2011)
Article DOI: 10.1016/j.bmc.2010.04.099
BindingDB Entry DOI: 10.7270/Q27H1KJJ