BDBM50321885 (E)-5-((1H-Indol-3yl)methylene)-2-imino-1,3-dimethylimidazolidin-4-one::CHEMBL404232::aplysinopsin
SMILES: CN1C(=N)N(C)\C(=C\c2c[nH]c3ccccc23)C1=O
InChI Key: InChIKey=AZGOVLGMSGAOMP-FZYUQVBKSA-N
Data: 3 KI  2 IC50
Activity Spreadsheet -- Enzyme Inhibition Constant Data from BindingDB
Found 5 hits for monomerid = 50321885
Trg + Lig
Ki
nM
ΔG°
kcal/mole
IC50
nM
Kd
nM
EC50/IC50
nM
koff
s-1
kon
M-1s-1
pHTemp
°C
5-hydroxytryptamine receptor 2A
(Homo sapiens (Human))
BDBM50321885
((E)-5-((1H-Indol-3yl)methylene)-2-imino-1,3-dimeth...)
Show SMILES CN1C(=N)N(C)\C(=C\c2c[nH]c3ccccc23)C1=O
Show InChI InChI=1S/C14H14N4O/c1-17-12(13(19)18(2)14(17)15)7-9-8-16-11-6-4-3-5-10(9)11/h3-8,15-16H,1-2H3/b12-7+,15-14?
Reactome pathway
598n/an/an/an/an/an/an/an/a
University of North Texas Health Science Center
Curated by ChEMBL
Assay Description
Displacement of [3H]methylspiperone from human cloned 5HT2A receptor expressed in HEK293 cells after 90 mins by liquid scintillation counting
Bioorg Med Chem 18: 4783-92 (2011)
Article DOI: 10.1016/j.bmc.2010.05.017
BindingDB Entry DOI: 10.7270/Q2V69KJ2
5-hydroxytryptamine receptor 3A
(Homo sapiens (Human))
BDBM50321885
((E)-5-((1H-Indol-3yl)methylene)-2-imino-1,3-dimeth...)
Show SMILES CN1C(=N)N(C)\C(=C\c2c[nH]c3ccccc23)C1=O
Show InChI InChI=1S/C14H14N4O/c1-17-12(13(19)18(2)14(17)15)7-9-8-16-11-6-4-3-5-10(9)11/h3-8,15-16H,1-2H3/b12-7+,15-14?
Reactome pathway
3.03E+3n/an/an/an/an/an/an/an/a
University of Mississippi
Curated by ChEMBL
Assay Description
Displacement of [3H]GR65630 from human recombinant 5HT3 receptor expressed in HEKT cells
Bioorg Med Chem 21: 7083-90 (2013)
Article DOI: 10.1016/j.bmc.2013.09.011
BindingDB Entry DOI: 10.7270/Q2RJ4KXM
5-hydroxytryptamine receptor 2C
(Homo sapiens (Human))
BDBM50321885
((E)-5-((1H-Indol-3yl)methylene)-2-imino-1,3-dimeth...)
Show SMILES CN1C(=N)N(C)\C(=C\c2c[nH]c3ccccc23)C1=O
Show InChI InChI=1S/C14H14N4O/c1-17-12(13(19)18(2)14(17)15)7-9-8-16-11-6-4-3-5-10(9)11/h3-8,15-16H,1-2H3/b12-7+,15-14?
Reactome pathway
1.45E+4n/an/an/an/an/an/an/an/a
University of North Texas Health Science Center
Curated by ChEMBL
Assay Description
Displacement of [3H]mesulergine from human cloned 5HT2C receptor expressed in HEK293 cells after 90 mins by liquid scintillation counting
Bioorg Med Chem 18: 4783-92 (2011)
Article DOI: 10.1016/j.bmc.2010.05.017
BindingDB Entry DOI: 10.7270/Q2V69KJ2
Amine oxidase [flavin-containing] B
(Homo sapiens (Human))
BDBM50321885
((E)-5-((1H-Indol-3yl)methylene)-2-imino-1,3-dimeth...)
Show SMILES CN1C(=N)N(C)\C(=C\c2c[nH]c3ccccc23)C1=O
Show InChI InChI=1S/C14H14N4O/c1-17-12(13(19)18(2)14(17)15)7-9-8-16-11-6-4-3-5-10(9)11/h3-8,15-16H,1-2H3/b12-7+,15-14?
n/an/a 1.00E+4n/an/an/an/an/an/a
University of Mississippi
Curated by ChEMBL
Assay Description
Inhibition of human recombinant MAO-B using kynuramine as substrate preincubated with compound for 15 mins measured after 20 mins by fluorometric ana...
Bioorg Med Chem Lett 22: 4926-9 (2012)
Article DOI: 10.1016/j.bmcl.2012.06.058
BindingDB Entry DOI: 10.7270/Q21Z45GF
Amine oxidase (flavin-containing) A
(Homo sapiens (Human))
BDBM50321885
((E)-5-((1H-Indol-3yl)methylene)-2-imino-1,3-dimeth...)
Show SMILES CN1C(=N)N(C)\C(=C\c2c[nH]c3ccccc23)C1=O
Show InChI InChI=1S/C14H14N4O/c1-17-12(13(19)18(2)14(17)15)7-9-8-16-11-6-4-3-5-10(9)11/h3-8,15-16H,1-2H3/b12-7+,15-14?
n/an/a 35n/an/an/an/an/an/a
University of Mississippi
Curated by ChEMBL
Assay Description
Inhibition of human recombinant MAO-A using kynuramine as substrate preincubated with compound for 15 mins measured after 20 mins by fluorometric ana...
Bioorg Med Chem Lett 22: 4926-9 (2012)
Article DOI: 10.1016/j.bmcl.2012.06.058
BindingDB Entry DOI: 10.7270/Q21Z45GF