BDBM50321973 CHEMBL1172959::N-(4-Carbamoylphenyl)-2-morpholino-9H-purin-6-amine
SMILES: NC(=O)c1ccc(Nc2nc(nc3nc[nH]c23)N2CCOCC2)cc1
InChI Key: InChIKey=MVHSHEWJPASWKI-UHFFFAOYSA-N
Data: 1 IC50
Activity Spreadsheet -- Enzyme Inhibition Constant Data from BindingDB
Found 1 hit for monomerid = 50321973
Trg + Lig
Ki
nM
ΔG°
kcal/mole
IC50
nM
Kd
nM
EC50/IC50
nM
koff
s-1
kon
M-1s-1
pHTemp
°C
Proto-oncogene tyrosine-protein kinase Src
(Homo sapiens (Human))
BDBM50321973
(CHEMBL1172959 | N-(4-Carbamoylphenyl)-2-morpholino...)
Show SMILES NC(=O)c1ccc(Nc2nc(nc3nc[nH]c23)N2CCOCC2)cc1
Show InChI InChI=1S/C16H17N7O2/c17-13(24)10-1-3-11(4-2-10)20-15-12-14(19-9-18-12)21-16(22-15)23-5-7-25-8-6-23/h1-4,9H,5-8H2,(H2,17,24)(H2,18,19,20,21,22)
n/an/a 2.01E+3n/an/an/an/an/an/a
Chinese Academy of Sciences
Curated by ChEMBL
Assay Description
Inhibition cSRC
Bioorg Med Chem 18: 4615-24 (2011)
Article DOI: 10.1016/j.bmc.2010.05.032
BindingDB Entry DOI: 10.7270/Q26H4JCQ