BDBM50321980 CHEMBL1172839::N-(4-Nitrophenyl)-2-(4-(2-hydroxyethyl)piperazin-1-yl)-9H-purin-6-amine
SMILES: OCCN1CCN(CC1)c1nc(Nc2ccc(cc2)[N+]([O-])=O)c2[nH]cnc2n1
InChI Key: InChIKey=VCDISXDGHWTILW-UHFFFAOYSA-N
Data: 1 IC50
Activity Spreadsheet -- Enzyme Inhibition Constant Data from BindingDB
Found 1 hit for monomerid = 50321980
Trg + Lig
Ki
nM
ΔG°
kcal/mole
IC50
nM
Kd
nM
EC50/IC50
nM
koff
s-1
kon
M-1s-1
pHTemp
°C
Proto-oncogene tyrosine-protein kinase Src
(Homo sapiens (Human))
BDBM50321980
(CHEMBL1172839 | N-(4-Nitrophenyl)-2-(4-(2-hydroxye...)
Show SMILES OCCN1CCN(CC1)c1nc(Nc2ccc(cc2)[N+]([O-])=O)c2[nH]cnc2n1
Show InChI InChI=1S/C17H20N8O3/c26-10-9-23-5-7-24(8-6-23)17-21-15-14(18-11-19-15)16(22-17)20-12-1-3-13(4-2-12)25(27)28/h1-4,11,26H,5-10H2,(H2,18,19,20,21,22)
n/an/a 780n/an/an/an/an/an/a
Chinese Academy of Sciences
Curated by ChEMBL
Assay Description
Inhibition cSRC
Bioorg Med Chem 18: 4615-24 (2011)
Article DOI: 10.1016/j.bmc.2010.05.032
BindingDB Entry DOI: 10.7270/Q26H4JCQ