BDBM50322295 CHEMBL1171977::N-[3-Cyano-4-{3-[(N,N-dimethylglycyl)amino]phenyl}-6-(4-fluoro-2-hydroxyphenyl)pyridin-2-yl]furan-2-carboxamide
SMILES: CN(C)CC(=O)Nc1cccc(c1)-c1cc(nc(NC(=O)c2ccco2)c1C#N)-c1ccc(F)cc1O
InChI Key: InChIKey=HYCGCNWUUVRFCO-UHFFFAOYSA-N
Data: 2 IC50
Activity Spreadsheet -- Enzyme Inhibition Constant Data from BindingDB
Found 2 hits for monomerid = 50322295
Trg + Lig
Ki
nM
ΔG°
kcal/mole
IC50
nM
Kd
nM
EC50/IC50
nM
koff
s-1
kon
M-1s-1
pHTemp
°C
KiSS-1 receptor
(Rattus norvegicus)
BDBM50322295
(CHEMBL1171977 | N-[3-Cyano-4-{3-[(N,N-dimethylglyc...)
Show SMILES CN(C)CC(=O)Nc1cccc(c1)-c1cc(nc(NC(=O)c2ccco2)c1C#N)-c1ccc(F)cc1O
Show InChI InChI=1S/C27H22FN5O4/c1-33(2)15-25(35)30-18-6-3-5-16(11-18)20-13-22(19-9-8-17(28)12-23(19)34)31-26(21(20)14-29)32-27(36)24-7-4-10-37-24/h3-13,34H,15H2,1-2H3,(H,30,35)(H,31,32,36)
Reactome pathway
n/an/a 130n/an/an/an/an/an/a
Takeda Pharmaceutical Company, Ltd
Curated by ChEMBL
Assay Description
Displacement of [125I]metastin from rat GPR54 receptor expressed in CHO cells
Bioorg Med Chem 18: 5157-71 (2010)
Article DOI: 10.1016/j.bmc.2010.05.061
BindingDB Entry DOI: 10.7270/Q21R6RHM
G-protein Coupled Receptor 54
(Homo sapiens (Human))
BDBM50322295
(CHEMBL1171977 | N-[3-Cyano-4-{3-[(N,N-dimethylglyc...)
Show SMILES CN(C)CC(=O)Nc1cccc(c1)-c1cc(nc(NC(=O)c2ccco2)c1C#N)-c1ccc(F)cc1O
Show InChI InChI=1S/C27H22FN5O4/c1-33(2)15-25(35)30-18-6-3-5-16(11-18)20-13-22(19-9-8-17(28)12-23(19)34)31-26(21(20)14-29)32-27(36)24-7-4-10-37-24/h3-13,34H,15H2,1-2H3,(H,30,35)(H,31,32,36)
Reactome pathway
n/an/a 12n/an/an/an/an/an/a
Takeda Pharmaceutical Company, Ltd
Curated by ChEMBL
Assay Description
Displacement of [125I]metastin from human GPR54 receptor expressed in CHO cells
Bioorg Med Chem 18: 5157-71 (2010)
Article DOI: 10.1016/j.bmc.2010.05.061
BindingDB Entry DOI: 10.7270/Q21R6RHM