BDBM50322634 (S)-2-((S)-2-((S)-2-((S)-1-((S)-2-((S)-2-amino-3-phenylpropanamido)-3-(naphthalen-1-yl)propanoyl)pyrrolidine-2-carboxamido)-4-methylpentanamido)propanamido)-5-guanidinopentanoic acid::CHEMBL1170220
SMILES: [#6]-[#6](-[#6])-[#6]-[#6@H](-[#7]-[#6](=O)-[#6@@H]-1-[#6]-[#6]-[#6]-[#7]-1-[#6](=O)-[#6@H](-[#6]-c1cccc2ccccc12)-[#7]-[#6](=O)-[#6@@H](-[#7])-[#6]-c1ccccc1)-[#6](=O)-[#7]-[#6@@H](-[#6])-[#6](=O)-[#7]-[#6@@H](-[#6]-[#6]-[#6]\[#7]=[#6](/[#7])-[#7])-[#6](-[#8])=O
InChI Key: InChIKey=KXRIOYLSJCAEGF-LEOAUMQFSA-N
Data: 2 EC50
Activity Spreadsheet -- Enzyme Inhibition Constant Data from BindingDB
Found 2 hits for monomerid = 50322634
Trg + Lig
Ki
nM
ΔG°
kcal/mole
IC50
nM
Kd
nM
EC50/IC50
nM
koff
s-1
kon
M-1s-1
pHTemp
°C
C3a anaphylatoxin chemotactic receptor
(Homo sapiens (Human))
BDBM50322634
((S)-2-((S)-2-((S)-2-((S)-1-((S)-2-((S)-2-amino-3-p...)
Show SMILES [#6]-[#6](-[#6])-[#6]-[#6@H](-[#7]-[#6](=O)-[#6@@H]-1-[#6]-[#6]-[#6]-[#7]-1-[#6](=O)-[#6@H](-[#6]-c1cccc2ccccc12)-[#7]-[#6](=O)-[#6@@H](-[#7])-[#6]-c1ccccc1)-[#6](=O)-[#7]-[#6@@H](-[#6])-[#6](=O)-[#7]-[#6@@H](-[#6]-[#6]-[#6]\[#7]=[#6](/[#7])-[#7])-[#6](-[#8])=O |r|
Show InChI InChI=1S/C42H57N9O7/c1-25(2)22-33(38(54)47-26(3)36(52)48-32(41(57)58)18-10-20-46-42(44)45)49-39(55)35-19-11-21-51(35)40(56)34(24-29-16-9-15-28-14-7-8-17-30(28)29)50-37(53)31(43)23-27-12-5-4-6-13-27/h4-9,12-17,25-26,31-35H,10-11,18-24,43H2,1-3H3,(H,47,54)(H,48,52)(H,49,55)(H,50,53)(H,57,58)(H4,44,45,46)/t26-,31-,32-,33-,34-,35-/m0/s1
Reactome pathway
n/an/an/an/a 720n/an/an/an/a
The University of Queensland
Curated by ChEMBL
Assay Description
Antagonist activity at human C3a receptor in human U937 cells assessed as inhibition of intracellular calcium mobilization
J Med Chem 53: 4938-48 (2010)
Article DOI: 10.1021/jm1003705
BindingDB Entry DOI: 10.7270/Q2QR4X9F
C3a anaphylatoxin chemotactic receptor
(Homo sapiens (Human))
BDBM50322634
((S)-2-((S)-2-((S)-2-((S)-1-((S)-2-((S)-2-amino-3-p...)
Show SMILES [#6]-[#6](-[#6])-[#6]-[#6@H](-[#7]-[#6](=O)-[#6@@H]-1-[#6]-[#6]-[#6]-[#7]-1-[#6](=O)-[#6@H](-[#6]-c1cccc2ccccc12)-[#7]-[#6](=O)-[#6@@H](-[#7])-[#6]-c1ccccc1)-[#6](=O)-[#7]-[#6@@H](-[#6])-[#6](=O)-[#7]-[#6@@H](-[#6]-[#6]-[#6]\[#7]=[#6](/[#7])-[#7])-[#6](-[#8])=O |r|
Show InChI InChI=1S/C42H57N9O7/c1-25(2)22-33(38(54)47-26(3)36(52)48-32(41(57)58)18-10-20-46-42(44)45)49-39(55)35-19-11-21-51(35)40(56)34(24-29-16-9-15-28-14-7-8-17-30(28)29)50-37(53)31(43)23-27-12-5-4-6-13-27/h4-9,12-17,25-26,31-35H,10-11,18-24,43H2,1-3H3,(H,47,54)(H,48,52)(H,49,55)(H,50,53)(H,57,58)(H4,44,45,46)/t26-,31-,32-,33-,34-,35-/m0/s1
Reactome pathway
n/an/an/an/a 720n/an/an/an/a
The University of Queensland
Curated by ChEMBL
Assay Description
Agonist activity at human C3a receptor in human U937 cells assessed as induction of intracellular calcium release
J Med Chem 53: 4938-48 (2010)
Article DOI: 10.1021/jm1003705
BindingDB Entry DOI: 10.7270/Q2QR4X9F