BDBM50322804 (5,6-Diphenylfuro[2,3-d]pyrimidin-4-yl)-(2-morpholin-4-ylethyl)-amine::CHEMBL1173522
SMILES: C(CN1CCOCC1)Nc1ncnc2oc(c(-c3ccccc3)c12)-c1ccccc1
InChI Key: InChIKey=HCVIUTOAKUKQLC-UHFFFAOYSA-N
Data: 1 IC50
Activity Spreadsheet -- Enzyme Inhibition Constant Data from BindingDB
Found 1 hit for monomerid = 50322804
Trg + Lig
Ki
nM
ΔG°
kcal/mole
IC50
nM
Kd
nM
EC50/IC50
nM
koff
s-1
kon
M-1s-1
pHTemp
°C
Aurora kinase A
(Homo sapiens (Human))
BDBM50322804
((5,6-Diphenylfuro[2,3-d]pyrimidin-4-yl)-(2-morphol...)
Show SMILES C(CN1CCOCC1)Nc1ncnc2oc(c(-c3ccccc3)c12)-c1ccccc1
Show InChI InChI=1S/C24H24N4O2/c1-3-7-18(8-4-1)20-21-23(25-11-12-28-13-15-29-16-14-28)26-17-27-24(21)30-22(20)19-9-5-2-6-10-19/h1-10,17H,11-16H2,(H,25,26,27)
NCI pathway
Reactome pathway
n/an/a 1.77E+3n/an/an/an/an/an/a
National Health Research Institutes
Curated by ChEMBL
Assay Description
Inhibition of Aurora A
J Med Chem 53: 4980-8 (2010)
Checked by Author
Article DOI: 10.1021/jm1000198
BindingDB Entry DOI: 10.7270/Q2Z60P87