BDBM50322806 3-(5,6-Diphenylfuro[2,3-d]pyrimidin-4-ylamino)propionic Acid Ethyl Ester::CHEMBL1173586
SMILES: CCOC(=O)CCNc1ncnc2oc(c(-c3ccccc3)c12)-c1ccccc1
InChI Key: InChIKey=DYFZERNFYWXNIZ-UHFFFAOYSA-N
Data: 1 IC50
Activity Spreadsheet -- Enzyme Inhibition Constant Data from BindingDB
Found 1 hit for monomerid = 50322806
Trg + Lig
Ki
nM
ΔG°
kcal/mole
IC50
nM
Kd
nM
EC50/IC50
nM
koff
s-1
kon
M-1s-1
pHTemp
°C
Aurora kinase A
(Homo sapiens (Human))
BDBM50322806
(3-(5,6-Diphenylfuro[2,3-d]pyrimidin-4-ylamino)prop...)
Show SMILES CCOC(=O)CCNc1ncnc2oc(c(-c3ccccc3)c12)-c1ccccc1
Show InChI InChI=1S/C23H21N3O3/c1-2-28-18(27)13-14-24-22-20-19(16-9-5-3-6-10-16)21(17-11-7-4-8-12-17)29-23(20)26-15-25-22/h3-12,15H,2,13-14H2,1H3,(H,24,25,26)
NCI pathway
Reactome pathway
n/an/a 796n/an/an/an/an/an/a
National Health Research Institutes
Curated by ChEMBL
Assay Description
Inhibition of Aurora A
J Med Chem 53: 4980-8 (2010)
Checked by Author
Article DOI: 10.1021/jm1000198
BindingDB Entry DOI: 10.7270/Q2Z60P87