BDBM50322808 CHEMBL1173152::S-2-(5,6-Diphenylfuro[2,3-d]pyrimidin-4-ylamino)propan-1-ol
SMILES: C[C@@H](CO)Nc1ncnc2oc(c(-c3ccccc3)c12)-c1ccccc1
InChI Key: InChIKey=MUKXYIDGJCNPIW-AWEZNQCLSA-N
Data: 1 IC50
Activity Spreadsheet -- Enzyme Inhibition Constant Data from BindingDB
Found 1 hit for monomerid = 50322808
Trg + Lig
Ki
nM
ΔG°
kcal/mole
IC50
nM
Kd
nM
EC50/IC50
nM
koff
s-1
kon
M-1s-1
pHTemp
°C
Aurora kinase A
(Homo sapiens (Human))
BDBM50322808
(CHEMBL1173152 | S-2-(5,6-Diphenylfuro[2,3-d]pyrimi...)
Show SMILES C[C@@H](CO)Nc1ncnc2oc(c(-c3ccccc3)c12)-c1ccccc1 |r|
Show InChI InChI=1S/C21H19N3O2/c1-14(12-25)24-20-18-17(15-8-4-2-5-9-15)19(16-10-6-3-7-11-16)26-21(18)23-13-22-20/h2-11,13-14,25H,12H2,1H3,(H,22,23,24)/t14-/m0/s1
NCI pathway
Reactome pathway
n/an/a 792n/an/an/an/an/an/a
National Health Research Institutes
Curated by ChEMBL
Assay Description
Inhibition of Aurora A
J Med Chem 53: 4980-8 (2010)
Checked by Author
Article DOI: 10.1021/jm1000198
BindingDB Entry DOI: 10.7270/Q2Z60P87