BDBM50322822 (S)-N-(3-(4-(2-hydroxy-1-phenylethylamino)-6-phenylfuro[2,3-d]pyrimidin-5-yl)phenyl)acrylamide::CHEMBL1172843
SMILES: OC[C@@H](Nc1ncnc2oc(c(-c3cccc(NC(=O)C=C)c3)c12)-c1ccccc1)c1ccccc1
InChI Key: InChIKey=GFTOODFOXIDLNF-HSZRJFAPSA-N
Data: 5 IC50
Activity Spreadsheet -- Enzyme Inhibition Constant Data from BindingDB
Found 5 hits for monomerid = 50322822
Trg + Lig
Ki
nM
ΔG°
kcal/mole
IC50
nM
Kd
nM
EC50/IC50
nM
koff
s-1
kon
M-1s-1
pHTemp
°C
Epidermal growth factor receptor
(Homo sapiens (Human))
BDBM50322822
((S)-N-(3-(4-(2-hydroxy-1-phenylethylamino)-6-pheny...)
Show SMILES OC[C@@H](Nc1ncnc2oc(c(-c3cccc(NC(=O)C=C)c3)c12)-c1ccccc1)c1ccccc1 |r|
Show InChI InChI=1S/C29H24N4O3/c1-2-24(35)32-22-15-9-14-21(16-22)25-26-28(33-23(17-34)19-10-5-3-6-11-19)30-18-31-29(26)36-27(25)20-12-7-4-8-13-20/h2-16,18,23,34H,1,17H2,(H,32,35)(H,30,31,33)/t23-/m1/s1
n/an/a 7n/an/an/an/an/an/a
National Health Research Institutes
Curated by ChEMBL
Assay Description
Inhibition of GST-tagged EGFR expressed in Escherichia coli
J Med Chem 53: 4980-8 (2010)
Checked by Author
Article DOI: 10.1021/jm1000198
BindingDB Entry DOI: 10.7270/Q2Z60P87
Epidermal growth factor receptor
(Homo sapiens (Human))
BDBM50322822
((S)-N-(3-(4-(2-hydroxy-1-phenylethylamino)-6-pheny...)
Show SMILES OC[C@@H](Nc1ncnc2oc(c(-c3cccc(NC(=O)C=C)c3)c12)-c1ccccc1)c1ccccc1 |r|
Show InChI InChI=1S/C29H24N4O3/c1-2-24(35)32-22-15-9-14-21(16-22)25-26-28(33-23(17-34)19-10-5-3-6-11-19)30-18-31-29(26)36-27(25)20-12-7-4-8-13-20/h2-16,18,23,34H,1,17H2,(H,32,35)(H,30,31,33)/t23-/m1/s1
n/an/a 20n/an/an/an/an/an/a
National Health Research Institutes
Curated by ChEMBL
Assay Description
Inhibition of GST-tagged human EGFR kinase domain (696 to 1022 residues) using poly(Glu, Tyr) 4:1 substrate incubated for 60 mins by kinase-Glo plus ...
J Med Chem 62: 10108-10123 (2019)
Article DOI: 10.1021/acs.jmedchem.9b00722
Epidermal growth factor receptor
(Homo sapiens (Human))
BDBM50322822
((S)-N-(3-(4-(2-hydroxy-1-phenylethylamino)-6-pheny...)
Show SMILES OC[C@@H](Nc1ncnc2oc(c(-c3cccc(NC(=O)C=C)c3)c12)-c1ccccc1)c1ccccc1 |r|
Show InChI InChI=1S/C29H24N4O3/c1-2-24(35)32-22-15-9-14-21(16-22)25-26-28(33-23(17-34)19-10-5-3-6-11-19)30-18-31-29(26)36-27(25)20-12-7-4-8-13-20/h2-16,18,23,34H,1,17H2,(H,32,35)(H,30,31,33)/t23-/m1/s1
n/an/a 27n/an/an/an/an/an/a
National Health Research Institutes
Curated by ChEMBL
Assay Description
Inhibition of GST-tagged human EGFR kinase domain I858R/T790M mutant (696 to 1022 residues) using EGFR L858R/T790M substrate peptide incubated for 12...
J Med Chem 62: 10108-10123 (2019)
Article DOI: 10.1021/acs.jmedchem.9b00722
Epidermal growth factor receptor
(Homo sapiens (Human))
BDBM50322822
((S)-N-(3-(4-(2-hydroxy-1-phenylethylamino)-6-pheny...)
Show SMILES OC[C@@H](Nc1ncnc2oc(c(-c3cccc(NC(=O)C=C)c3)c12)-c1ccccc1)c1ccccc1 |r|
Show InChI InChI=1S/C29H24N4O3/c1-2-24(35)32-22-15-9-14-21(16-22)25-26-28(33-23(17-34)19-10-5-3-6-11-19)30-18-31-29(26)36-27(25)20-12-7-4-8-13-20/h2-16,18,23,34H,1,17H2,(H,32,35)(H,30,31,33)/t23-/m1/s1
n/an/a 20n/an/an/an/an/an/a
National Health Research Institutes
Curated by ChEMBL
Assay Description
Inhibition of GST-tagged human EGFR kinase domain (696 to 1022 residues) using poly(Glu, Tyr) 4:1 substrate incubated for 60 mins by kinase-Glo plus ...
J Med Chem 62: 10108-10123 (2019)
Article DOI: 10.1021/acs.jmedchem.9b00722
Epidermal growth factor receptor
(Homo sapiens (Human))
BDBM50322822
((S)-N-(3-(4-(2-hydroxy-1-phenylethylamino)-6-pheny...)
Show SMILES OC[C@@H](Nc1ncnc2oc(c(-c3cccc(NC(=O)C=C)c3)c12)-c1ccccc1)c1ccccc1 |r|
Show InChI InChI=1S/C29H24N4O3/c1-2-24(35)32-22-15-9-14-21(16-22)25-26-28(33-23(17-34)19-10-5-3-6-11-19)30-18-31-29(26)36-27(25)20-12-7-4-8-13-20/h2-16,18,23,34H,1,17H2,(H,32,35)(H,30,31,33)/t23-/m1/s1
n/an/a 27n/an/an/an/an/an/a
National Health Research Institutes
Curated by ChEMBL
Assay Description
Inhibition of GST-tagged human EGFR kinase domain I858R/T790M mutant (696 to 1022 residues) using EGFR L858R/T790M substrate peptide incubated for 12...
J Med Chem 62: 10108-10123 (2019)
Article DOI: 10.1021/acs.jmedchem.9b00722