BDBM50322950 2-(3-chloro-4-fluorophenyl)-7-(5-fluoro-6-(trifluoromethyl)-1H-benzo[d]imidazol-2-yl)-3-(pyridin-2-yl)-2,7-diazaspiro[3.5]nonan-1-one::CHEMBL1210902
SMILES: Fc1ccc(cc1Cl)N1C(c2ccccn2)C2(CCN(CC2)c2nc3cc(c(F)cc3[nH]2)C(F)(F)F)C1=O
InChI Key: InChIKey=XVGFCIHXNZUCGJ-UHFFFAOYSA-N
Data: 3 IC50
Activity Spreadsheet -- Enzyme Inhibition Constant Data from BindingDB
Found 3 hits for monomerid = 50322950
Trg + Lig
Ki
nM
ΔG°
kcal/mole
IC50
nM
Kd
nM
EC50/IC50
nM
koff
s-1
kon
M-1s-1
pHTemp
°C
Voltage-dependent T-type calcium channel subunit alpha-1H
(Homo sapiens (Human))
BDBM50322950
(2-(3-chloro-4-fluorophenyl)-7-(5-fluoro-6-(trifluo...)
Show SMILES Fc1ccc(cc1Cl)N1C(c2ccccn2)C2(CCN(CC2)c2nc3cc(c(F)cc3[nH]2)C(F)(F)F)C1=O
Show InChI InChI=1S/C26H19ClF5N5O/c27-16-11-14(4-5-17(16)28)37-22(19-3-1-2-8-33-19)25(23(37)38)6-9-36(10-7-25)24-34-20-12-15(26(30,31)32)18(29)13-21(20)35-24/h1-5,8,11-13,22H,6-7,9-10H2,(H,34,35)
n/an/a 106n/an/an/an/an/an/a
Merck Research Laboratory
Curated by ChEMBL
Assay Description
Inhibition of human CaV3.2 expressed in HEK293 cells at -100 mV membrane potential by whole cell path clamp method
Bioorg Med Chem Lett 20: 4602-6 (2010)
Article DOI: 10.1016/j.bmcl.2010.06.012
BindingDB Entry DOI: 10.7270/Q2NS0V34
Voltage-dependent T-type calcium channel subunit alpha-1H
(Homo sapiens (Human))
BDBM50322950
(2-(3-chloro-4-fluorophenyl)-7-(5-fluoro-6-(trifluo...)
Show SMILES Fc1ccc(cc1Cl)N1C(c2ccccn2)C2(CCN(CC2)c2nc3cc(c(F)cc3[nH]2)C(F)(F)F)C1=O
Show InChI InChI=1S/C26H19ClF5N5O/c27-16-11-14(4-5-17(16)28)37-22(19-3-1-2-8-33-19)25(23(37)38)6-9-36(10-7-25)24-34-20-12-15(26(30,31)32)18(29)13-21(20)35-24/h1-5,8,11-13,22H,6-7,9-10H2,(H,34,35)
n/an/a 29n/an/an/an/an/an/a
Merck Research Laboratory
Curated by ChEMBL
Assay Description
Inhibition of human CaV3.2 expressed in HEK293 cells at -100 mV membrane potential by Ionworks HT assay
Bioorg Med Chem Lett 20: 4602-6 (2010)
Article DOI: 10.1016/j.bmcl.2010.06.012
BindingDB Entry DOI: 10.7270/Q2NS0V34
Voltage-dependent T-type calcium channel subunit alpha-1H
(Homo sapiens (Human))
BDBM50322950
(2-(3-chloro-4-fluorophenyl)-7-(5-fluoro-6-(trifluo...)
Show SMILES Fc1ccc(cc1Cl)N1C(c2ccccn2)C2(CCN(CC2)c2nc3cc(c(F)cc3[nH]2)C(F)(F)F)C1=O
Show InChI InChI=1S/C26H19ClF5N5O/c27-16-11-14(4-5-17(16)28)37-22(19-3-1-2-8-33-19)25(23(37)38)6-9-36(10-7-25)24-34-20-12-15(26(30,31)32)18(29)13-21(20)35-24/h1-5,8,11-13,22H,6-7,9-10H2,(H,34,35)
n/an/a 31n/an/an/an/an/an/a
Merck Research Laboratory
Curated by ChEMBL
Assay Description
Inhibition of human CaV3.2 expressed in HEK293 cells at -100 mV membrane potential by Ionworks HT assay
Bioorg Med Chem Lett 20: 4602-6 (2010)
Article DOI: 10.1016/j.bmcl.2010.06.012
BindingDB Entry DOI: 10.7270/Q2NS0V34