BDBM50322983 CHEMBL1210144::N-(1-((2,6-diethoxybiphenyl-4-yl)methyl)piperidin-4-yl)-6-(methylamino)nicotinamide
SMILES: CCOc1cc(CN2CCC(CC2)NC(=O)c2ccc(NC)nc2)cc(OCC)c1-c1ccccc1
InChI Key: InChIKey=WXIPBSOPCYLJTO-UHFFFAOYSA-N
Data: 1 KI  1 EC50
Activity Spreadsheet -- Enzyme Inhibition Constant Data from BindingDB
Found 2 hits for monomerid = 50322983
Trg + Lig
Ki
nM
ΔG°
kcal/mole
IC50
nM
Kd
nM
EC50/IC50
nM
koff
s-1
kon
M-1s-1
pHTemp
°C
Somatostatin receptor type 5
(Homo sapiens (Human))
BDBM50322983
(CHEMBL1210144 | N-(1-((2,6-diethoxybiphenyl-4-yl)m...)
Show SMILES CCOc1cc(CN2CCC(CC2)NC(=O)c2ccc(NC)nc2)cc(OCC)c1-c1ccccc1
Show InChI InChI=1S/C29H36N4O3/c1-4-35-25-17-21(18-26(36-5-2)28(25)22-9-7-6-8-10-22)20-33-15-13-24(14-16-33)32-29(34)23-11-12-27(30-3)31-19-23/h6-12,17-19,24H,4-5,13-16,20H2,1-3H3,(H,30,31)(H,32,34)
Reactome pathway
6.90n/an/an/an/an/an/an/an/a
F. Hoffmann-La Roche Ltd
Curated by ChEMBL
Assay Description
Displacement of radio labeled 11 Tyr SST14 from human SST5 receptor expressed in CHO cells
Bioorg Med Chem Lett 20: 4521-5 (2010)
Article DOI: 10.1016/j.bmcl.2010.06.026
BindingDB Entry DOI: 10.7270/Q2J103BN
Somatostatin receptor type 5
(Homo sapiens (Human))
BDBM50322983
(CHEMBL1210144 | N-(1-((2,6-diethoxybiphenyl-4-yl)m...)
Show SMILES CCOc1cc(CN2CCC(CC2)NC(=O)c2ccc(NC)nc2)cc(OCC)c1-c1ccccc1
Show InChI InChI=1S/C29H36N4O3/c1-4-35-25-17-21(18-26(36-5-2)28(25)22-9-7-6-8-10-22)20-33-15-13-24(14-16-33)32-29(34)23-11-12-27(30-3)31-19-23/h6-12,17-19,24H,4-5,13-16,20H2,1-3H3,(H,30,31)(H,32,34)
Reactome pathway
n/an/an/an/a>1.00E+3n/an/an/an/a
F. Hoffmann-La Roche Ltd
Curated by ChEMBL
Assay Description
Antagonist activity at human SST5 receptor expressed in CHO cells assessed as inhibition of forskolin-induced cAMP accumulation by FRET assay
Bioorg Med Chem Lett 20: 4521-5 (2010)
Article DOI: 10.1016/j.bmcl.2010.06.026
BindingDB Entry DOI: 10.7270/Q2J103BN