BDBM50323020 4-((1S,2S,6R,7R)-9-Isobutyryl-1,7-dimethyl-3,5-dioxo-11-oxa-4,9-diaza-tricyclo[5.3.1.0*2,6*]undec-4-yl)-2-trifluoromethyl-benzonitrile::CHEMBL1209905
SMILES: CC(C)C(=O)N1C[C@]2(C)O[C@](C)(C1)c1c(O)n(c(O)c21)-c1ccc(C#N)c(c1)C(F)(F)F
InChI Key: InChIKey=IBRHLVKMNMCOQJ-OYRHEFFESA-N
Data: 1 KI  2 IC50
Activity Spreadsheet -- Enzyme Inhibition Constant Data from BindingDB
Found 3 hits for monomerid = 50323020
Trg + Lig
Ki
nM
ΔG°
kcal/mole
IC50
nM
Kd
nM
EC50/IC50
nM
koff
s-1
kon
M-1s-1
pHTemp
°C
Androgen Receptor
(Homo sapiens (Human))
BDBM50323020
(4-((1S,2S,6R,7R)-9-Isobutyryl-1,7-dimethyl-3,5-dio...)
Show SMILES CC(C)C(=O)N1C[C@]2(C)O[C@](C)(C1)c1c(O)n(c(O)c21)-c1ccc(C#N)c(c1)C(F)(F)F |r|
Show InChI InChI=1S/C22H22F3N3O4/c1-11(2)17(29)27-9-20(3)15-16(21(4,10-27)32-20)19(31)28(18(15)30)13-6-5-12(8-26)14(7-13)22(23,24)25/h5-7,11,30-31H,9-10H2,1-4H3/t20-,21+
NCI pathway
Reactome pathway
39n/an/an/an/an/an/an/an/a
Bristol-Myers Squibb Company
Curated by ChEMBL
Assay Description
Displacement of [3H]DHT from AR in human MDA-MB-453 cells
Bioorg Med Chem Lett 20: 4491-5 (2010)
Article DOI: 10.1016/j.bmcl.2010.06.034
BindingDB Entry DOI: 10.7270/Q2MK6DVH
Androgen Receptor
(Homo sapiens (Human))
BDBM50323020
(4-((1S,2S,6R,7R)-9-Isobutyryl-1,7-dimethyl-3,5-dio...)
Show SMILES CC(C)C(=O)N1C[C@]2(C)O[C@](C)(C1)c1c(O)n(c(O)c21)-c1ccc(C#N)c(c1)C(F)(F)F |r|
Show InChI InChI=1S/C22H22F3N3O4/c1-11(2)17(29)27-9-20(3)15-16(21(4,10-27)32-20)19(31)28(18(15)30)13-6-5-12(8-26)14(7-13)22(23,24)25/h5-7,11,30-31H,9-10H2,1-4H3/t20-,21+
NCI pathway
Reactome pathway
n/an/a 1.61E+3n/an/an/an/an/an/a
Bristol-Myers Squibb Company
Curated by ChEMBL
Assay Description
Antagonist activity at wild type human AR expressed in human LNCAP cells by transactivation assay
Bioorg Med Chem Lett 20: 4491-5 (2010)
Article DOI: 10.1016/j.bmcl.2010.06.034
BindingDB Entry DOI: 10.7270/Q2MK6DVH
Androgen Receptor
(Homo sapiens (Human))
BDBM50323020
(4-((1S,2S,6R,7R)-9-Isobutyryl-1,7-dimethyl-3,5-dio...)
Show SMILES CC(C)C(=O)N1C[C@]2(C)O[C@](C)(C1)c1c(O)n(c(O)c21)-c1ccc(C#N)c(c1)C(F)(F)F |r|
Show InChI InChI=1S/C22H22F3N3O4/c1-11(2)17(29)27-9-20(3)15-16(21(4,10-27)32-20)19(31)28(18(15)30)13-6-5-12(8-26)14(7-13)22(23,24)25/h5-7,11,30-31H,9-10H2,1-4H3/t20-,21+
NCI pathway
Reactome pathway
n/an/a 215n/an/an/an/an/an/a
Bristol-Myers Squibb Company
Curated by ChEMBL
Assay Description
Antagonist activity at human wild type AR expressed in human MDA-MB-435 cells by transactivation assay
Bioorg Med Chem Lett 20: 4491-5 (2010)
Article DOI: 10.1016/j.bmcl.2010.06.034
BindingDB Entry DOI: 10.7270/Q2MK6DVH