BDBM50323046 1-Biphenyl-3-yl-ethanone, O-(1-piperidinocarbonyl)oxime::CHEMBL1210096
SMILES: CC(=NOC(=O)N1CCCCC1)c1cccc(c1)-c1ccccc1
InChI Key: InChIKey=IUMQYRORRJHBDW-UHFFFAOYSA-N
Data: 1 IC50
Activity Spreadsheet -- Enzyme Inhibition Constant Data from BindingDB
Found 1 hit for monomerid = 50323046
Trg + Lig
Ki
nM
ΔG°
kcal/mole
IC50
nM
Kd
nM
EC50/IC50
nM
koff
s-1
kon
M-1s-1
pHTemp
°C
Anandamide amidohydrolase
(Mus musculus (mouse))
BDBM50323046
(1-Biphenyl-3-yl-ethanone, O-(1-piperidinocarbonyl)...)
Show SMILES CC(=NOC(=O)N1CCCCC1)c1cccc(c1)-c1ccccc1 |w:2.2|
Show InChI InChI=1S/C20H22N2O2/c1-16(21-24-20(23)22-13-6-3-7-14-22)18-11-8-12-19(15-18)17-9-4-2-5-10-17/h2,4-5,8-12,15H,3,6-7,13-14H2,1H3
n/an/a 220n/an/an/an/an/an/a
Università degli Studi di Milano
Curated by ChEMBL
Assay Description
Inhibition of mouse brain FAAH assessed as conversion of [3H-ethanolamine]AEA to [3H]ethanolamine by scintillation counting
Bioorg Med Chem Lett 20: 4406-11 (2010)
Article DOI: 10.1016/j.bmcl.2010.06.050
BindingDB Entry DOI: 10.7270/Q24Q7V5B