BDBM50323051 1-Biphenyl-3-yl-ethanone, O-(1-naphthylaminocarbonyl)oxime::CHEMBL1210041
SMILES: CC(=NOC(=O)Nc1cccc2ccccc12)c1cccc(c1)-c1ccccc1
InChI Key: InChIKey=PFOVYLREHBMJIO-UHFFFAOYSA-N
Data: 1 IC50
Activity Spreadsheet -- Enzyme Inhibition Constant Data from BindingDB
Found 1 hit for monomerid = 50323051
Trg + Lig
Ki
nM
ΔG°
kcal/mole
IC50
nM
Kd
nM
EC50/IC50
nM
koff
s-1
kon
M-1s-1
pHTemp
°C
Anandamide amidohydrolase
(Mus musculus (mouse))
BDBM50323051
(1-Biphenyl-3-yl-ethanone, O-(1-naphthylaminocarbon...)
Show SMILES CC(=NOC(=O)Nc1cccc2ccccc12)c1cccc(c1)-c1ccccc1 |w:2.2|
Show InChI InChI=1S/C25H20N2O2/c1-18(21-13-7-14-22(17-21)19-9-3-2-4-10-19)27-29-25(28)26-24-16-8-12-20-11-5-6-15-23(20)24/h2-17H,1H3,(H,26,28)
n/an/a 10n/an/an/an/an/an/a
Università degli Studi di Milano
Curated by ChEMBL
Assay Description
Inhibition of mouse brain FAAH assessed as conversion of [3H-ethanolamine]AEA to [3H]ethanolamine by scintillation counting
Bioorg Med Chem Lett 20: 4406-11 (2010)
Article DOI: 10.1016/j.bmcl.2010.06.050
BindingDB Entry DOI: 10.7270/Q24Q7V5B