null
SMILES: CCN1CCN(CCCn2cc(cn2)-c2ccc3n(cnc3c2)-c2cc(O[C@H](C)c3ccccc3Cl)c(s2)C(N)=O)CC1
InChI Key: InChIKey=XWUCTSMJFVUKTR-JOCHJYFZSA-N
Activity Spreadsheet -- Enzyme Inhibition Constant Data from BindingDB
Found 4 hits for monomerid = 50323102
Trg + Lig
Ki
nM
ΔG°
kcal/mole
IC50
nM
Kd
nM
EC50/IC50
nM
koff
s-1
kon
M-1s-1
pHTemp
°C
Cytochrome P450 2C9
(Homo sapiens (Human))
BDBM50323102
((R)-3-(1-(2-chlorophenyl)ethoxy)-5-(5-(1-(3-(4-eth...)
Show SMILES CCN1CCN(CCCn2cc(cn2)-c2ccc3n(cnc3c2)-c2cc(O[C@H](C)c3ccccc3Cl)c(s2)C(N)=O)CC1 |r|
Show InChI InChI=1S/C32H36ClN7O2S/c1-3-37-13-15-38(16-14-37)11-6-12-39-20-24(19-36-39)23-9-10-28-27(17-23)35-21-40(28)30-18-29(31(43-30)32(34)41)42-22(2)25-7-4-5-8-26(25)33/h4-5,7-10,17-22H,3,6,11-16H2,1-2H3,(H2,34,41)/t22-/m1/s1
Reactome pathway
n/an/a 2.40E+3n/an/an/an/an/an/a
GlaxoSmithKline
Curated by ChEMBL
Assay Description
Inhibition of human recombinant CYP2C9 using 7-methoxy-4-trifluoromethylcoumarin-3-acetic acid as substrate by fluorescence plate reader
Bioorg Med Chem Lett 20: 4587-92 (2010)
Article DOI: 10.1016/j.bmcl.2010.06.009
BindingDB Entry DOI: 10.7270/Q2MS3SZB
Serine/threonine-protein kinase PLK1
(Homo sapiens (Human))
BDBM50323102
((R)-3-(1-(2-chlorophenyl)ethoxy)-5-(5-(1-(3-(4-eth...)
Show SMILES CCN1CCN(CCCn2cc(cn2)-c2ccc3n(cnc3c2)-c2cc(O[C@H](C)c3ccccc3Cl)c(s2)C(N)=O)CC1 |r|
Show InChI InChI=1S/C32H36ClN7O2S/c1-3-37-13-15-38(16-14-37)11-6-12-39-20-24(19-36-39)23-9-10-28-27(17-23)35-21-40(28)30-18-29(31(43-30)32(34)41)42-22(2)25-7-4-5-8-26(25)33/h4-5,7-10,17-22H,3,6,11-16H2,1-2H3,(H2,34,41)/t22-/m1/s1
NCI pathway
Reactome pathway
n/an/a 1n/an/an/an/an/an/a
GlaxoSmithKline
Curated by ChEMBL
Assay Description
Inhibition of PLK1 by SPA assay
Bioorg Med Chem Lett 20: 4587-92 (2010)
Article DOI: 10.1016/j.bmcl.2010.06.009
BindingDB Entry DOI: 10.7270/Q2MS3SZB
Cytochrome P450 3A4
(Homo sapiens (Human))
BDBM50323102
((R)-3-(1-(2-chlorophenyl)ethoxy)-5-(5-(1-(3-(4-eth...)
Show SMILES CCN1CCN(CCCn2cc(cn2)-c2ccc3n(cnc3c2)-c2cc(O[C@H](C)c3ccccc3Cl)c(s2)C(N)=O)CC1 |r|
Show InChI InChI=1S/C32H36ClN7O2S/c1-3-37-13-15-38(16-14-37)11-6-12-39-20-24(19-36-39)23-9-10-28-27(17-23)35-21-40(28)30-18-29(31(43-30)32(34)41)42-22(2)25-7-4-5-8-26(25)33/h4-5,7-10,17-22H,3,6,11-16H2,1-2H3,(H2,34,41)/t22-/m1/s1
Reactome pathway
n/an/a 4.50E+3n/an/an/an/an/an/a
GlaxoSmithKline
Curated by ChEMBL
Assay Description
Inhibition of human recombinant CYP3A4 using 7-benzyloxyquinoline as substrate by fluorescence plate reader
Bioorg Med Chem Lett 20: 4587-92 (2010)
Article DOI: 10.1016/j.bmcl.2010.06.009
BindingDB Entry DOI: 10.7270/Q2MS3SZB
Cytochrome P450 3A4
(Homo sapiens (Human))
BDBM50323102
((R)-3-(1-(2-chlorophenyl)ethoxy)-5-(5-(1-(3-(4-eth...)
Show SMILES CCN1CCN(CCCn2cc(cn2)-c2ccc3n(cnc3c2)-c2cc(O[C@H](C)c3ccccc3Cl)c(s2)C(N)=O)CC1 |r|
Show InChI InChI=1S/C32H36ClN7O2S/c1-3-37-13-15-38(16-14-37)11-6-12-39-20-24(19-36-39)23-9-10-28-27(17-23)35-21-40(28)30-18-29(31(43-30)32(34)41)42-22(2)25-7-4-5-8-26(25)33/h4-5,7-10,17-22H,3,6,11-16H2,1-2H3,(H2,34,41)/t22-/m1/s1
Reactome pathway
n/an/a 1.00E+3n/an/an/an/an/an/a
GlaxoSmithKline
Curated by ChEMBL
Assay Description
Inhibition of human recombinant CYP3A4 using diethoxyfluorescein as substrate by fluorescence plate reader
Bioorg Med Chem Lett 20: 4587-92 (2010)
Article DOI: 10.1016/j.bmcl.2010.06.009
BindingDB Entry DOI: 10.7270/Q2MS3SZB