BDBM50323395 5-(thiophen-2-yl)-1,4,5,6-tetrahydrocyclopenta[c]pyrazole-3-carboxylic acid::CHEMBL1208924
SMILES: OC(=O)c1n[nH]c2CC(Cc12)c1cccs1
InChI Key: InChIKey=SFQJREZXBUMOEM-UHFFFAOYSA-N
Data: 2 IC50
Activity Spreadsheet -- Enzyme Inhibition Constant Data from BindingDB
Found 2 hits for monomerid = 50323395
Trg + Lig
Ki
nM
ΔG°
kcal/mole
IC50
nM
Kd
nM
EC50/IC50
nM
koff
s-1
kon
M-1s-1
pHTemp
°C
Hydroxycarboxylic acid receptor 2
(Homo sapiens (Human))
BDBM50323395
(5-(thiophen-2-yl)-1,4,5,6-tetrahydrocyclopenta[c]p...)
Show SMILES OC(=O)c1n[nH]c2CC(Cc12)c1cccs1
Show InChI InChI=1S/C11H10N2O2S/c14-11(15)10-7-4-6(5-8(7)12-13-10)9-2-1-3-16-9/h1-3,6H,4-5H2,(H,12,13)(H,14,15)
Reactome pathway
n/an/a 240n/an/an/an/an/an/a
Merck Research Laboratories
Curated by ChEMBL
Assay Description
Displacement of [3H]nicotinic acid from human GPR10a receptor
Bioorg Med Chem Lett 20: 4472-4 (2010)
Article DOI: 10.1016/j.bmcl.2010.06.041
BindingDB Entry DOI: 10.7270/Q2B858B5
Hydroxycarboxylic acid receptor 2
(Mus musculus)
BDBM50323395
(5-(thiophen-2-yl)-1,4,5,6-tetrahydrocyclopenta[c]p...)
Show SMILES OC(=O)c1n[nH]c2CC(Cc12)c1cccs1
Show InChI InChI=1S/C11H10N2O2S/c14-11(15)10-7-4-6(5-8(7)12-13-10)9-2-1-3-16-9/h1-3,6H,4-5H2,(H,12,13)(H,14,15)
Reactome pathway
n/an/a 250n/an/an/an/an/an/a
Merck Research Laboratories
Curated by ChEMBL
Assay Description
Displacement of [3H]nicotinic acid from mouse GPR10a receptor
Bioorg Med Chem Lett 20: 4472-4 (2010)
Article DOI: 10.1016/j.bmcl.2010.06.041
BindingDB Entry DOI: 10.7270/Q2B858B5