BDBM50323417 CHEMBL1209275::N-(2-(3-(3-tert-butyl-5-(3-phenylureido)-1H-pyrazol-1-yl)benzylamino)-2-oxoethyl)benzamide
SMILES: CC(C)(C)c1cc(NC(=O)Nc2ccccc2)n(n1)-c1cccc(CNC(=O)CNC(=O)c2ccccc2)c1
InChI Key: InChIKey=QQVDBOJAHUNOKC-UHFFFAOYSA-N
Data: 2 IC50
Activity Spreadsheet -- Enzyme Inhibition Constant Data from BindingDB
Found 2 hits for monomerid = 50323417
Trg + Lig
Ki
nM
ΔG°
kcal/mole
IC50
nM
Kd
nM
EC50/IC50
nM
koff
s-1
kon
M-1s-1
pHTemp
°C
Mitogen-activated protein kinase 14
(Homo sapiens (Human))
BDBM50323417
(CHEMBL1209275 | N-(2-(3-(3-tert-butyl-5-(3-phenylu...)
Show SMILES CC(C)(C)c1cc(NC(=O)Nc2ccccc2)n(n1)-c1cccc(CNC(=O)CNC(=O)c2ccccc2)c1
Show InChI InChI=1S/C30H32N6O3/c1-30(2,3)25-18-26(34-29(39)33-23-14-8-5-9-15-23)36(35-25)24-16-10-11-21(17-24)19-31-27(37)20-32-28(38)22-12-6-4-7-13-22/h4-18H,19-20H2,1-3H3,(H,31,37)(H,32,38)(H2,33,34,39)
NCI pathway
Reactome pathway
n/an/a 441n/an/an/an/an/an/a
Pfizer Inc.
Curated by ChEMBL
Assay Description
Inhibition of active p38alpha
Bioorg Med Chem Lett 20: 4885-91 (2010)
Article DOI: 10.1016/j.bmcl.2010.06.073
BindingDB Entry DOI: 10.7270/Q2Z31ZT2
Mitogen-activated protein kinase 14
(Homo sapiens (Human))
BDBM50323417
(CHEMBL1209275 | N-(2-(3-(3-tert-butyl-5-(3-phenylu...)
Show SMILES CC(C)(C)c1cc(NC(=O)Nc2ccccc2)n(n1)-c1cccc(CNC(=O)CNC(=O)c2ccccc2)c1
Show InChI InChI=1S/C30H32N6O3/c1-30(2,3)25-18-26(34-29(39)33-23-14-8-5-9-15-23)36(35-25)24-16-10-11-21(17-24)19-31-27(37)20-32-28(38)22-12-6-4-7-13-22/h4-18H,19-20H2,1-3H3,(H,31,37)(H,32,38)(H2,33,34,39)
NCI pathway
Reactome pathway
n/an/a 169n/an/an/an/an/an/a
Pfizer Inc.
Curated by ChEMBL
Assay Description
Inhibition of unactive p38alpha
Bioorg Med Chem Lett 20: 4885-91 (2010)
Article DOI: 10.1016/j.bmcl.2010.06.073
BindingDB Entry DOI: 10.7270/Q2Z31ZT2