BDBM50323421 2-acetamido-N-(3-(3-tert-butyl-5-(3-phenylureido)-1H-pyrazol-1-yl)benzyl)propanamide::CHEMBL1209344
SMILES: CC(NC(C)=O)C(=O)NCc1cccc(c1)-n1nc(cc1NC(=O)Nc1ccccc1)C(C)(C)C
InChI Key: InChIKey=GMJCCMACNPNZPZ-UHFFFAOYSA-N
Data: 2 IC50
Activity Spreadsheet -- Enzyme Inhibition Constant Data from BindingDB
Found 2 hits for monomerid = 50323421
Trg + Lig
Ki
nM
ΔG°
kcal/mole
IC50
nM
Kd
nM
EC50/IC50
nM
koff
s-1
kon
M-1s-1
pHTemp
°C
Mitogen-activated protein kinase 14
(Homo sapiens (Human))
BDBM50323421
(2-acetamido-N-(3-(3-tert-butyl-5-(3-phenylureido)-...)
Show SMILES CC(NC(C)=O)C(=O)NCc1cccc(c1)-n1nc(cc1NC(=O)Nc1ccccc1)C(C)(C)C
Show InChI InChI=1S/C26H32N6O3/c1-17(28-18(2)33)24(34)27-16-19-10-9-13-21(14-19)32-23(15-22(31-32)26(3,4)5)30-25(35)29-20-11-7-6-8-12-20/h6-15,17H,16H2,1-5H3,(H,27,34)(H,28,33)(H2,29,30,35)
NCI pathway
Reactome pathway
n/an/a 480n/an/an/an/an/an/a
Pfizer Inc.
Curated by ChEMBL
Assay Description
Inhibition of active p38alpha
Bioorg Med Chem Lett 20: 4885-91 (2010)
Article DOI: 10.1016/j.bmcl.2010.06.073
BindingDB Entry DOI: 10.7270/Q2Z31ZT2
Mitogen-activated protein kinase 14
(Homo sapiens (Human))
BDBM50323421
(2-acetamido-N-(3-(3-tert-butyl-5-(3-phenylureido)-...)
Show SMILES CC(NC(C)=O)C(=O)NCc1cccc(c1)-n1nc(cc1NC(=O)Nc1ccccc1)C(C)(C)C
Show InChI InChI=1S/C26H32N6O3/c1-17(28-18(2)33)24(34)27-16-19-10-9-13-21(14-19)32-23(15-22(31-32)26(3,4)5)30-25(35)29-20-11-7-6-8-12-20/h6-15,17H,16H2,1-5H3,(H,27,34)(H,28,33)(H2,29,30,35)
NCI pathway
Reactome pathway
n/an/a 168n/an/an/an/an/an/a
Pfizer Inc.
Curated by ChEMBL
Assay Description
Inhibition of unactive p38alpha
Bioorg Med Chem Lett 20: 4885-91 (2010)
Article DOI: 10.1016/j.bmcl.2010.06.073
BindingDB Entry DOI: 10.7270/Q2Z31ZT2