null
SMILES: CC(C)(C)c1cc(NC(=O)Nc2ccccc2)n(n1)-c1cccc(CNC(=O)Cn2ccnc2)c1
InChI Key: InChIKey=GEYDOOCYEMSGGX-UHFFFAOYSA-N
Activity Spreadsheet -- Enzyme Inhibition Constant Data from BindingDB
Found 2 hits for monomerid = 50323428
Trg + Lig
Ki
nM
ΔG°
kcal/mole
IC50
nM
Kd
nM
EC50/IC50
nM
koff
s-1
kon
M-1s-1
pHTemp
°C
Mitogen-activated protein kinase 14
(Homo sapiens (Human))
BDBM50323428
(CHEMBL1209483 | N-(3-(3-tert-butyl-5-(3-phenylurei...)
Show SMILES CC(C)(C)c1cc(NC(=O)Nc2ccccc2)n(n1)-c1cccc(CNC(=O)Cn2ccnc2)c1
Show InChI InChI=1S/C26H29N7O2/c1-26(2,3)22-15-23(30-25(35)29-20-9-5-4-6-10-20)33(31-22)21-11-7-8-19(14-21)16-28-24(34)17-32-13-12-27-18-32/h4-15,18H,16-17H2,1-3H3,(H,28,34)(H2,29,30,35)
NCI pathway
Reactome pathway
n/an/a 536n/an/an/an/an/an/a
Pfizer Inc.
Curated by ChEMBL
Assay Description
Inhibition of active p38alpha
Bioorg Med Chem Lett 20: 4885-91 (2010)
Article DOI: 10.1016/j.bmcl.2010.06.073
BindingDB Entry DOI: 10.7270/Q2Z31ZT2
Mitogen-activated protein kinase 14
(Homo sapiens (Human))
BDBM50323428
(CHEMBL1209483 | N-(3-(3-tert-butyl-5-(3-phenylurei...)
Show SMILES CC(C)(C)c1cc(NC(=O)Nc2ccccc2)n(n1)-c1cccc(CNC(=O)Cn2ccnc2)c1
Show InChI InChI=1S/C26H29N7O2/c1-26(2,3)22-15-23(30-25(35)29-20-9-5-4-6-10-20)33(31-22)21-11-7-8-19(14-21)16-28-24(34)17-32-13-12-27-18-32/h4-15,18H,16-17H2,1-3H3,(H,28,34)(H2,29,30,35)
NCI pathway
Reactome pathway
n/an/a 231n/an/an/an/an/an/a
Pfizer Inc.
Curated by ChEMBL
Assay Description
Inhibition of unactive p38alpha
Bioorg Med Chem Lett 20: 4885-91 (2010)
Article DOI: 10.1016/j.bmcl.2010.06.073
BindingDB Entry DOI: 10.7270/Q2Z31ZT2