BDBM50323440 2-((S)-6-chloro-1'-((3S,4R)-4-(2,4-difluorophenyl)-1-(1-hydroxy-2-methylpropan-2-yl)pyrrolidine-3-carbonyl)-5-methyl-3H-spiro[isobenzofuran-1,4'-piperidine]-3-yl)-2-methylpropanenitrile::CHEMBL1209707
SMILES: Cc1cc2[C@H](OC3(CCN(CC3)C(=O)[C@@H]3CN(C[C@H]3c3ccc(F)cc3F)C(C)(C)CO)c2cc1Cl)C(C)(C)C#N
InChI Key: InChIKey=RIESXOQQPSBSSY-JPYHZWLXSA-N
Data: 1 IC50  2 EC50
Activity Spreadsheet -- Enzyme Inhibition Constant Data from BindingDB
Found 3 hits for monomerid = 50323440
Trg + Lig
Ki
nM
ΔG°
kcal/mole
IC50
nM
Kd
nM
EC50/IC50
nM
koff
s-1
kon
M-1s-1
pHTemp
°C
Melanocortin receptor 4
(Homo sapiens (Human))
BDBM50323440
(2-((S)-6-chloro-1'-((3S,4R)-4-(2,4-difluorophenyl)...)
Show SMILES Cc1cc2[C@H](OC3(CCN(CC3)C(=O)[C@@H]3CN(C[C@H]3c3ccc(F)cc3F)C(C)(C)CO)c2cc1Cl)C(C)(C)C#N |r|
Show InChI InChI=1S/C32H38ClF2N3O3/c1-19-12-22-25(14-26(19)33)32(41-28(22)30(2,3)17-36)8-10-37(11-9-32)29(40)24-16-38(31(4,5)18-39)15-23(24)21-7-6-20(34)13-27(21)35/h6-7,12-14,23-24,28,39H,8-11,15-16,18H2,1-5H3/t23-,24+,28-/m0/s1
n/an/an/an/a 2.60n/an/an/an/a
Merck Research Laboratories
Curated by ChEMBL
Assay Description
Agonist activity at human melanocortin 4 receptor expressed in CHO cells assessed as cAMP release
Bioorg Med Chem Lett 20: 4895-900 (2010)
Article DOI: 10.1016/j.bmcl.2010.06.068
BindingDB Entry DOI: 10.7270/Q2TB172P
Melanocortin receptor 4
(Homo sapiens (Human))
BDBM50323440
(2-((S)-6-chloro-1'-((3S,4R)-4-(2,4-difluorophenyl)...)
Show SMILES Cc1cc2[C@H](OC3(CCN(CC3)C(=O)[C@@H]3CN(C[C@H]3c3ccc(F)cc3F)C(C)(C)CO)c2cc1Cl)C(C)(C)C#N |r|
Show InChI InChI=1S/C32H38ClF2N3O3/c1-19-12-22-25(14-26(19)33)32(41-28(22)30(2,3)17-36)8-10-37(11-9-32)29(40)24-16-38(31(4,5)18-39)15-23(24)21-7-6-20(34)13-27(21)35/h6-7,12-14,23-24,28,39H,8-11,15-16,18H2,1-5H3/t23-,24+,28-/m0/s1
n/an/a 2.80n/an/an/an/an/an/a
Merck Research Laboratories
Curated by ChEMBL
Assay Description
Displacement of [125I]NDP-alpha-MSH from human melanocortin 4 receptor expressed in CHO cells
Bioorg Med Chem Lett 20: 4895-900 (2010)
Article DOI: 10.1016/j.bmcl.2010.06.068
BindingDB Entry DOI: 10.7270/Q2TB172P
Melatonin receptor type 1B
(Homo sapiens (Human))
BDBM50323440
(2-((S)-6-chloro-1'-((3S,4R)-4-(2,4-difluorophenyl)...)
Show SMILES Cc1cc2[C@H](OC3(CCN(CC3)C(=O)[C@@H]3CN(C[C@H]3c3ccc(F)cc3F)C(C)(C)CO)c2cc1Cl)C(C)(C)C#N |r|
Show InChI InChI=1S/C32H38ClF2N3O3/c1-19-12-22-25(14-26(19)33)32(41-28(22)30(2,3)17-36)8-10-37(11-9-32)29(40)24-16-38(31(4,5)18-39)15-23(24)21-7-6-20(34)13-27(21)35/h6-7,12-14,23-24,28,39H,8-11,15-16,18H2,1-5H3/t23-,24+,28-/m0/s1
Reactome pathway
n/an/an/an/a 343n/an/an/an/a
Merck Research Laboratories
Curated by ChEMBL
Assay Description
Inhibition of human melatonin receptor type 1B
Bioorg Med Chem Lett 20: 4895-900 (2010)
Article DOI: 10.1016/j.bmcl.2010.06.068
BindingDB Entry DOI: 10.7270/Q2TB172P