BDBM50323458 (S)-(6-chloro-3-(2-((S)-3-hydroxypyrrolidin-1-yl)propan-2-yl)-5-methyl-3H-spiro[isobenzofuran-1,4'-piperidine]-1'-yl)((3S,4R)-4-(2,4-difluorophenyl)-1-(tetrahydro-2H-pyran-4-yl)pyrrolidin-3-yl)methanone::CHEMBL1209801
SMILES: Cc1cc2[C@H](OC3(CCN(CC3)C(=O)[C@@H]3CN(C[C@H]3c3ccc(F)cc3F)C3CCOCC3)c2cc1Cl)C(C)(C)N1CC[C@H](O)C1
InChI Key: InChIKey=LCZZNXMWRVFVOT-LYBDLDKZSA-N
Data: 1 IC50  1 EC50
Activity Spreadsheet -- Enzyme Inhibition Constant Data from BindingDB
Found 2 hits for monomerid = 50323458
Trg + Lig
Ki
nM
ΔG°
kcal/mole
IC50
nM
Kd
nM
EC50/IC50
nM
koff
s-1
kon
M-1s-1
pHTemp
°C
Melanocortin receptor 4
(Homo sapiens (Human))
BDBM50323458
((S)-(6-chloro-3-(2-((S)-3-hydroxypyrrolidin-1-yl)p...)
Show SMILES Cc1cc2[C@H](OC3(CCN(CC3)C(=O)[C@@H]3CN(C[C@H]3c3ccc(F)cc3F)C3CCOCC3)c2cc1Cl)C(C)(C)N1CC[C@H](O)C1 |r|
Show InChI InChI=1S/C36H46ClF2N3O4/c1-22-16-27-30(18-31(22)37)36(46-33(27)35(2,3)42-11-6-25(43)19-42)9-12-40(13-10-36)34(44)29-21-41(24-7-14-45-15-8-24)20-28(29)26-5-4-23(38)17-32(26)39/h4-5,16-18,24-25,28-29,33,43H,6-15,19-21H2,1-3H3/t25-,28-,29+,33-/m0/s1
n/an/a 1.40n/an/an/an/an/an/a
Merck Research Laboratories
Curated by ChEMBL
Assay Description
Displacement of [125I]NDP-alpha-MSH from human melanocortin 4 receptor expressed in CHO cells
Bioorg Med Chem Lett 20: 4895-900 (2010)
Article DOI: 10.1016/j.bmcl.2010.06.068
BindingDB Entry DOI: 10.7270/Q2TB172P
Melanocortin receptor 4
(Homo sapiens (Human))
BDBM50323458
((S)-(6-chloro-3-(2-((S)-3-hydroxypyrrolidin-1-yl)p...)
Show SMILES Cc1cc2[C@H](OC3(CCN(CC3)C(=O)[C@@H]3CN(C[C@H]3c3ccc(F)cc3F)C3CCOCC3)c2cc1Cl)C(C)(C)N1CC[C@H](O)C1 |r|
Show InChI InChI=1S/C36H46ClF2N3O4/c1-22-16-27-30(18-31(22)37)36(46-33(27)35(2,3)42-11-6-25(43)19-42)9-12-40(13-10-36)34(44)29-21-41(24-7-14-45-15-8-24)20-28(29)26-5-4-23(38)17-32(26)39/h4-5,16-18,24-25,28-29,33,43H,6-15,19-21H2,1-3H3/t25-,28-,29+,33-/m0/s1
n/an/an/an/a 0.800n/an/an/an/a
Merck Research Laboratories
Curated by ChEMBL
Assay Description
Agonist activity at human melanocortin 4 receptor expressed in CHO cells assessed as cAMP release
Bioorg Med Chem Lett 20: 4895-900 (2010)
Article DOI: 10.1016/j.bmcl.2010.06.068
BindingDB Entry DOI: 10.7270/Q2TB172P