BDBM50324268 (Z)-3-(2-{[5-(Ethylsulfonamido)-2-oxoindolin-3-ylidene]methyl}-4-oxo-4,5,6,7-tetrahydro-1H-indol-3-yl)propanoic Acid::CHEMBL1215147
SMILES: CCS(=O)(=O)Nc1ccc2NC(=O)C(=Cc3[nH]c4CCCC(=O)c4c3CCC(O)=O)c2c1
InChI Key: InChIKey=VDCTUISDNDCWAH-UHFFFAOYSA-N
Data: 1 IC50
Activity Spreadsheet -- Enzyme Inhibition Constant Data from BindingDB
Found 1 hit for monomerid = 50324268
Trg + Lig
Ki
nM
ΔG°
kcal/mole
IC50
nM
Kd
nM
EC50/IC50
nM
koff
s-1
kon
M-1s-1
pHTemp
°C
Aurora kinase A
(Homo sapiens (Human))
BDBM50324268
((Z)-3-(2-{[5-(Ethylsulfonamido)-2-oxoindolin-3-yli...)
Show SMILES CCS(=O)(=O)Nc1ccc2NC(=O)C(=Cc3[nH]c4CCCC(=O)c4c3CCC(O)=O)c2c1 |w:14.14|
Show InChI InChI=1S/C22H23N3O6S/c1-2-32(30,31)25-12-6-8-16-14(10-12)15(22(29)24-16)11-18-13(7-9-20(27)28)21-17(23-18)4-3-5-19(21)26/h6,8,10-11,23,25H,2-5,7,9H2,1H3,(H,24,29)(H,27,28)
NCI pathway
Reactome pathway
n/an/a 34n/an/an/an/an/an/a
Development Center for Biotechnology
Curated by ChEMBL
Assay Description
Inhibition of recombinant aurora A
J Med Chem 53: 5929-41 (2010)
Article DOI: 10.1021/jm1001869
BindingDB Entry DOI: 10.7270/Q2XS5VKS