BDBM50324270 (Z)-3-(4-Oxo-2-{[2-oxo-5-(phenylmethylsulfonamido)indolin-3-ylidene]methyl}-4,5,6,7-tetrahydro-1H-indol-3-yl)propanoic Acid::CHEMBL1215216
SMILES: OC(=O)CCc1c(C=C2C(=O)Nc3ccc(NS(=O)(=O)Cc4ccccc4)cc23)[nH]c2CCCC(=O)c12
InChI Key: InChIKey=WYLTWMHCCIFULE-UHFFFAOYSA-N
Data: 2 IC50
Activity Spreadsheet -- Enzyme Inhibition Constant Data from BindingDB
Found 2 hits for monomerid = 50324270
Trg + Lig
Ki
nM
ΔG°
kcal/mole
IC50
nM
Kd
nM
EC50/IC50
nM
koff
s-1
kon
M-1s-1
pHTemp
°C
Aurora kinase A
(Homo sapiens (Human))
BDBM50324270
((Z)-3-(4-Oxo-2-{[2-oxo-5-(phenylmethylsulfonamido)...)
Show SMILES OC(=O)CCc1c(C=C2C(=O)Nc3ccc(NS(=O)(=O)Cc4ccccc4)cc23)[nH]c2CCCC(=O)c12 |w:7.6|
Show InChI InChI=1S/C27H25N3O6S/c31-24-8-4-7-22-26(24)18(10-12-25(32)33)23(28-22)14-20-19-13-17(9-11-21(19)29-27(20)34)30-37(35,36)15-16-5-2-1-3-6-16/h1-3,5-6,9,11,13-14,28,30H,4,7-8,10,12,15H2,(H,29,34)(H,32,33)
NCI pathway
Reactome pathway
n/an/a 63n/an/an/an/an/an/a
Development Center for Biotechnology
Curated by ChEMBL
Assay Description
Inhibition of recombinant aurora A
J Med Chem 53: 5929-41 (2010)
Article DOI: 10.1021/jm1001869
BindingDB Entry DOI: 10.7270/Q2XS5VKS
Aurora kinase B
(Homo sapiens (Human))
BDBM50324270
((Z)-3-(4-Oxo-2-{[2-oxo-5-(phenylmethylsulfonamido)...)
Show SMILES OC(=O)CCc1c(C=C2C(=O)Nc3ccc(NS(=O)(=O)Cc4ccccc4)cc23)[nH]c2CCCC(=O)c12 |w:7.6|
Show InChI InChI=1S/C27H25N3O6S/c31-24-8-4-7-22-26(24)18(10-12-25(32)33)23(28-22)14-20-19-13-17(9-11-21(19)29-27(20)34)30-37(35,36)15-16-5-2-1-3-6-16/h1-3,5-6,9,11,13-14,28,30H,4,7-8,10,12,15H2,(H,29,34)(H,32,33)
Reactome pathway
n/an/a 402n/an/an/an/an/an/a
Development Center for Biotechnology
Curated by ChEMBL
Assay Description
Inhibition of recombinant aurora B
J Med Chem 53: 5929-41 (2010)
Article DOI: 10.1021/jm1001869
BindingDB Entry DOI: 10.7270/Q2XS5VKS