BDBM50324285 (Z)-3-{2-[(5-Fluoro-2-oxoindolin-3-ylidene)methyl]-6,6-dimethyl-4-oxo-4,5,6,7-tetrahydro-1H-indol-3-yl}propanoicAcid::CHEMBL1214784
SMILES: CC1(C)Cc2[nH]c(C=C3C(=O)Nc4ccc(F)cc34)c(CCC(O)=O)c2C(=O)C1
InChI Key: InChIKey=CSGJTEYSKUXNMF-UHFFFAOYSA-N
Data: 1 IC50
Activity Spreadsheet -- Enzyme Inhibition Constant Data from BindingDB
Found 1 hit for monomerid = 50324285
Trg + Lig
Ki
nM
ΔG°
kcal/mole
IC50
nM
Kd
nM
EC50/IC50
nM
koff
s-1
kon
M-1s-1
pHTemp
°C
Aurora kinase A
(Homo sapiens (Human))
BDBM50324285
((Z)-3-{2-[(5-Fluoro-2-oxoindolin-3-ylidene)methyl]...)
Show SMILES CC1(C)Cc2[nH]c(C=C3C(=O)Nc4ccc(F)cc34)c(CCC(O)=O)c2C(=O)C1 |w:7.6|
Show InChI InChI=1S/C22H21FN2O4/c1-22(2)9-17-20(18(26)10-22)12(4-6-19(27)28)16(24-17)8-14-13-7-11(23)3-5-15(13)25-21(14)29/h3,5,7-8,24H,4,6,9-10H2,1-2H3,(H,25,29)(H,27,28)
NCI pathway
Reactome pathway
n/an/a 456n/an/an/an/an/an/a
Development Center for Biotechnology
Curated by ChEMBL
Assay Description
Inhibition of recombinant aurora A
J Med Chem 53: 5929-41 (2010)
Article DOI: 10.1021/jm1001869
BindingDB Entry DOI: 10.7270/Q2XS5VKS