BDBM50324305 CHEMBL1214711::N-(2-(pyrrolidin-1-yl)ethyl)-1-(3-(2-(tetrahydro-2H-pyran-4-ylamino)pyridin-4-yl)-2,6-naphthyridin-1-yl)piperidine-4-carboxamide
SMILES: O=C(NC1CCNCC1)C1CCN(CC1)c1nc(cc2cnccc12)-c1ccnc(NC2CCCCC2)c1
InChI Key: InChIKey=KOUMYNHGYBRABF-UHFFFAOYSA-N
Data: 2 IC50
Activity Spreadsheet -- Enzyme Inhibition Constant Data from BindingDB
Found 2 hits for monomerid = 50324305
Trg + Lig
Ki
nM
ΔG°
kcal/mole
IC50
nM
Kd
nM
EC50/IC50
nM
koff
s-1
kon
M-1s-1
pHTemp
°C
Serine/threonine-protein kinase D1
(Homo sapiens (Human))
BDBM50324305
(CHEMBL1214711 | N-(2-(pyrrolidin-1-yl)ethyl)-1-(3-...)
Show SMILES O=C(NC1CCNCC1)C1CCN(CC1)c1nc(cc2cnccc12)-c1ccnc(NC2CCCCC2)c1
Show InChI InChI=1S/C30H39N7O/c38-30(35-25-7-12-31-13-8-25)21-10-16-37(17-11-21)29-26-9-14-32-20-23(26)18-27(36-29)22-6-15-33-28(19-22)34-24-4-2-1-3-5-24/h6,9,14-15,18-21,24-25,31H,1-5,7-8,10-13,16-17H2,(H,33,34)(H,35,38)
NCI pathway
Reactome pathway
n/an/a 44n/an/an/an/an/an/a
Novartis Institutes for BioMedical Research
Curated by ChEMBL
Assay Description
Inhibition of PKD1 assessed as HDAC5 neuclear export
J Med Chem 53: 5400-21 (2010)
Article DOI: 10.1021/jm100075z
BindingDB Entry DOI: 10.7270/Q2T153T9
Serine/threonine-protein kinase D1
(Homo sapiens (Human))
BDBM50324305
(CHEMBL1214711 | N-(2-(pyrrolidin-1-yl)ethyl)-1-(3-...)
Show SMILES O=C(NC1CCNCC1)C1CCN(CC1)c1nc(cc2cnccc12)-c1ccnc(NC2CCCCC2)c1
Show InChI InChI=1S/C30H39N7O/c38-30(35-25-7-12-31-13-8-25)21-10-16-37(17-11-21)29-26-9-14-32-20-23(26)18-27(36-29)22-6-15-33-28(19-22)34-24-4-2-1-3-5-24/h6,9,14-15,18-21,24-25,31H,1-5,7-8,10-13,16-17H2,(H,33,34)(H,35,38)
NCI pathway
Reactome pathway
n/an/a 1n/an/an/an/an/an/a
Novartis Institutes for BioMedical Research
Curated by ChEMBL
Assay Description
Inhibition of PKD1 by TR-FRET assay
J Med Chem 53: 5400-21 (2010)
Article DOI: 10.1021/jm100075z
BindingDB Entry DOI: 10.7270/Q2T153T9